{"text_format":"1","workbook":"xlsx","n_sheets":16,"sheets":["Feuille-match","Etiquettes","Classement","Calendrier","moyennes CDBE","Moyennes","Distances","Equipes","Gestion","nouveaux joueurs","Gestion matchs","Matchs","Calculs equipes","Calculs joueurs","Resultat","5QUILLES"],"not_rendered":{"charts":0,"images":0,"macros":1,"external_links":0,"defined_names":49,"comments":1,"pivot_tables":10},"unopened":[],"bounds":{"document_bytes":16777216,"sheet_cells":100000,"rows_first":2000,"rows_last":500,"rows_between":2000,"halvings":0,"cell_chars":16384,"cell_head_chars":4096},"cells_cut":0,"cells_raw":0,"read":"whole","date_system":"1900"}

{"sheet":"Feuille-match","index":0,"n_rows":35,"n_cols":16,"rows_kept":35,"cut":false,"hidden":false,"merged":[[33,2,33,10],[34,1,34,15],[2,3,3,8],[2,9,3,9],[2,10,2,15],[3,10,3,15],[7,2,7,6],[7,10,7,14]]}
[]
[]
[null,{"$f":"CONCATENATE(\"Journée \",Journee_classement+1)","v":"Journée 8"},null,"Ne remplir que\nles cases sur fond blanc",null,null,null,null,null,"Après vos matchs, pensez\nà transmettre ce fichier\naux responsables ci-contre :","veteran@cdbebillard91.fr"]
[null,{"$f":"INDEX(Dates,Journee_classement+1)","v":"2026-01-20"},null,null,null,null,null,null,null,null,"com-sportive@cdbebillard91.fr"]
[null,17]
[]
[]
[null,"EQUIPE RECEVANTE :","-",null,null,null,null,null,null,"EQUIPE VISITEUSE :","-"]
{"$rows_left_out":28}
{"sheet":"Etiquettes","index":1,"n_rows":76,"n_cols":8,"rows_kept":76,"cut":false,"hidden":false,"merged":[[0,0,4,6],[0,7,4,8],[5,0,7,6],[5,7,7,8],[10,0,14,6],[10,7,14,8],[15,0,17,6],[15,7,17,8],[20,0,24,6],[20,7,24,8],[25,0,27,6],[25,7,27,8],[30,0,34,6],[30,7,34,8],[35,0,37,6],[35,7,37,8],[40,0,44,6],[40,7,44,8],[45,0,47,6],[45,7,47,8],[50,0,54,6],[50,7,54,8],[55,0,57,6],[55,7,57,8],[75,0,77,6],[75,7,77,8],[60,0,64,6],[60,7,64,8],[65,0,67,6],[65,7,67,8],[70,0,74,6],[70,7,74,8]]}
[{"$f":"'Feuille-match'!C8","v":"-"},null,null,null,null,null,null,{"$f":"'Feuille-match'!C13","v":""}]
[]
[]
[]
[]
[{"$f":"'Feuille-match'!B13","v":"-"},null,null,null,null,null,null,"LIBRE"]
[]
[]
{"$rows_left_out":69}
{"sheet":"Classement","index":2,"n_rows":39,"n_cols":15,"rows_kept":39,"cut":false,"hidden":false,"merged":[[0,12,0,14],[2,4,2,7],[15,2,15,4],[15,5,15,7],[17,1,17,4],[18,1,18,4],[19,1,19,4],[20,1,20,4],[21,1,21,4],[22,1,22,4],[23,1,23,4],[24,1,24,4],[34,2,34,11],[35,2,35,11],[36,2,36,11],[28,0,28,14],[29,0,29,14],[30,0,30,14],[31,1,31,11],[32,2,32,11],[33,2,33,11]]}
["CIRCUIT  VETERAN  ESSONNE  2024 / 2025  au :",null,null,null,null,null,null,null,null,null,null,null,{"$f":"IF(Journee_classement>0,INDEX(Dates,Journee_classement),\"\")","v":"2026-01-13"}]
[]
[null,null,null,7,"ème journée"]
[]
[null,"Classement",null,"pts",null,null,"jouées",null,"pour",null,"contre",null,"différence",null,"coefficient"]
[1,{"$f":"'Calculs equipes'!I53","v":"MORANGIS1"},null,{"$f":"'Calculs equipes'!K53","v":18},null,null,{"$f":"'Calculs equipes'!J53","v":7},null,{"$f":"'Calculs equipes'!L53","v":65},null,{"$f":"'Calculs equipes'!M53","v":47},null,{"$f":"'Calculs equipes'!N53","v":18},null,{"$f":"'Calculs equipes'!O53","v":0.93031750491711152}]
[2,{"$f":"'Calculs equipes'!I54","v":"MASSY"},null,{"$f":"'Calculs equipes'!K54","v":17},null,null,{"$f":"'Calculs equipes'!J54","v":7},null,{"$f":"'Calculs equipes'!L54","v":63},null,{"$f":"'Calculs equipes'!M54","v":49},null,{"$f":"'Calculs equipes'!N54","v":14},null,{"$f":"'Calculs equipes'!O54","v":0.85015527950310554}]
[3,{"$f":"'Calculs equipes'!I55","v":"MORANGIS2"},null,{"$f":"'Calculs equipes'!K55","v":17},null,null,{"$f":"'Calculs equipes'!J55","v":7},null,{"$f":"'Calculs equipes'!L55","v":57},null,{"$f":"'Calculs equipes'!M55","v":55},null,{"$f":"'Calculs equipes'!N55","v":2},null,{"$f":"'Calculs equipes'!O55","v":0.85969387755102045}]
{"$rows_left_out":32}
{"sheet":"Calendrier","index":3,"n_rows":38,"n_cols":16,"rows_kept":38,"cut":false,"hidden":false,"merged":[[0,0,1,10],[2,0,2,10],[3,0,4,4],[5,0,6,0],[5,1,6,1],[5,10,6,10],[5,3,6,3],[5,5,6,5],[5,7,6,7],[5,9,6,9],[7,7,8,7],[7,9,8,9],[9,3,10,3],[9,5,10,5],[9,7,10,7],[9,9,10,9],[15,0,16,0],[15,1,16,1],[15,10,16,10],[11,0,12,0],[7,0,8,0],[7,1,8,1],[7,10,8,10],[9,0,10,0],[9,1,10,1],[9,10,10,10],[7,3,8,3],[7,5,8,5],[17,0,18,0],[17,1,18,1],[17,10,18,10],[11,1,12,1],[11,10,12,10],[13,0,14,0],[13,1,14,1],[13,10,14,10],[11,3,12,3],[11,5,12,5],[11,7,12,7],[11,9,12,9],[13,3,14,3],[13,5,14,5],[13,7,14,7],[13,9,14,9],[15,3,16,3],[15,5,16,5],[15,7,16,7],[15,9,16,9],[17,3,18,3],[17,5,18,5],[17,7,18,7],[17,9,18,9],[19,0,19,10],[20,0,21,4],[22,10,23,10],[22,0,23,0],[22,1,23,1],[22,3,23,3],[22,5,23,5],[22,7,23,7],[22,9,23,9],[24,0,25,0],[24,1,25,1],[24,10,25,10],[26,0,27,0],[26,1,27,1],[26,10,27,10],[24,5,25,5],[24,7,25,7],[24,9,25,9],[26,3,27,3],[26,5,27,5],[26,7,27,7],[26,9,27,9],[24,3,25,3],[28,0,29,0],[28,1,29,1],[28,10,29,10],[30,0,31,0],[30,1,31,1],[30,10,31,10],[28,3,29,3],[28,5,29,5],[28,7,29,7],[28,9,29,9],[30,3,31,3],[30,5,31,5],[30,7,31,7],[30,9,31,9],[36,0,36,10],[37,0,37,10],[38,0,38,10],[32,0,33,0],[32,1,33,1],[32,10,33,10],[34,0,35,0],[34,1,35,1],[34,10,35,10],[32,3,33,3],[32,5,33,5],[32,7,33,7],[32,9,33,9],[34,3,35,3],[34,5,35,5],[34,7,35,7],[34,9,35,9]]}
["COMITE DEPARTEMENTAL DE BILLARD DE L'ESSONNE"]
[null,null,null,null,null,null,null,null,null,null,null,null,null,null,{"$f":"Gestion!C2","v":"ARPAJON"},{"$f":"COUNTIF($A$1:$K$36,O2)","v":14}]
["CALENDRIER  VETERAN  2025 / 2026",null,null,null,null,null,null,null,null,null,null,null,null,null,{"$f":"Gestion!#REF!","v":{"$error":"#REF!"}},0]
["Matchs Aller",null,null,null,null,null,null,null,null,null,null,null,null,null,{"$f":"Gestion!C3","v":"DRAVEIL"},14]
[null,null,null,null,null,null,null,null,null,null,"Exempt de la journée",null,null,null,{"$f":"Gestion!C4","v":"ETRECHY"},14]
[1,{"$f":"INDEX(Dates,A6)","v":"2025-11-18"},"MORANGIS1","MA","VIGNEUX1","MA","ETRECHY","MA","DRAVEIL","MA",null,null,null,null,{"$f":"Gestion!C5","v":"MASSY"},14]
[null,null,"MORANGIS2",null,"VIGNEUX2",null,"MASSY",null,"ARPAJON",null,null,null,null,null,{"$f":"Gestion!C6","v":"MORANGIS1"},14]
[2,{"$f":"INDEX(Dates,A8)","v":"2025-11-25"},"DRAVEIL","MA","ARPAJON","MA","MASSY","MA","VIGNEUX2","MA",null,null,null,null,{"$f":"Gestion!C7","v":"MORANGIS2"},14]
{"$rows_left_out":31}
{"sheet":"moyennes CDBE","index":4,"n_rows":173,"n_cols":10,"rows_kept":173,"cut":false,"hidden":false,"merged":[[0,0,0,9],[1,0,2,0],[1,1,2,1],[1,2,2,3],[1,4,2,5],[1,6,2,7],[1,8,1,9]]}
["moyennes vétérans en tournoi CDBE 2025/2026"]
["Noms","Prénoms","Libre",null,"1 Bande",null,"3bandes",null,"5 Quilles"]
[null,null,null,null,null,null,null,null,"faits","subis"]
["ALEXANDRE","michel",null,null,10,27,10,36]
[null,null,null,null,25,35,9,40]
[null,null,null,null,48,32,6,40]
[null,null,null,null,null,null,9,25]
[]
{"$rows_left_out":166}
{"sheet":"Moyennes","index":5,"n_rows":153,"n_cols":40,"rows_kept":153,"cut":false,"hidden":false,"merged":[[151,1,151,2],[3,26,3,29],[3,5,3,7],[3,14,3,16],[3,23,3,25],[2,0,4,0],[145,0,145,2],[146,0,146,2],[147,0,147,2],[149,0,149,2],[4,42,4,43],[2,1,4,1],[2,3,2,11],[3,3,3,4],[2,30,2,39],[3,35,3,39],[3,8,3,11],[3,17,3,20],[3,12,3,13],[2,12,2,20],[2,21,2,29],[3,21,3,22],[3,31,3,34]]}
[{"$f":"CONCATENATE(\"Moyennes  et  distances  pour  la  journée N°\",Journee_classement+1)","v":"Moyennes  et  distances  pour  la  journée N°8"}]
[null,null,null,2,null,null,null,null,null,null,null,null,4,null,null,null,null,null,null,null,null,6,null,null,null,null,null,null,null,null,30]
["Club","NOM",null,"LIBRE",null,null,null,null,null,null,null,null,"BANDE",null,null,null,null,null,null,null,null,"3  BANDES",null,null,null,null,null,null,null,null,"5 Quilles"]
[null,null,null,{"$f":"CONCATENATE(\"Ranking J\",Journee_classement+1)","v":"Ranking J8"},null,"Ranking initial",null,null,"Résultat vétérants",null,null,null,{"$f":"CONCATENATE(\"Ranking J\",Journee_classement+1)","v":"Ranking J8"},null,"Ranking initial",null,null,"Résultat vétérants",null,null,null,{"$f":"CONCATENATE(\"Ranking J\",Journee_classement+1)","v":"Ranking J8"},null,"Ranking initial",null,null,"Résultat vétérants",null,null,null,{"$f":"CONCATENATE(\"Ranking J\",Journee_classement+1)","v":"Ranking J8"},"Ranking initial",null,null,null,"Résultat vétérants"]
[null,null,null,"moyenne","distance","Source","Nbr match","moyenne","Nbr matchs","points","reprises","moyenne","moyenne","distance","Source","Nbr match","moyenne","Nbr matchs","points","reprises","moyenne","moyenne","distance","Source","Nbr match","moyenne","Nbr matchs","points","reprises","moyenne","distance","Source","Points joueur","Points adversaires","Distance","Nbr matchs","Points joueur","Points adversaires","moyenne","distance"]
["VIG","ABITBOL",null,{"$f":"IF(I6>0,IF(F6=\"ESTIMEE\",L6,(H6*G6+I6*L6)/(G6+I6)),H6)","v":"NC"},{"$f":"IFERROR(DISTANCELIBRE(D6,table),\"\")","v":""},null,null,"NC",{"$f":"IFERROR(GETPIVOTDATA(\"Nb parties\",Moyennes_libre,\"Joueur \",$B6),0)","v":0},{"$f":"IFERROR(GETPIVOTDATA(\"Total points\",Moyennes_libre,\"Joueur \",$B6),0)","v":0},{"$f":"IFERROR(GETPIVOTDATA(\"Total reprises\",Moyennes_libre,\"Joueur \",$B6),0)","v":0},{"$f":"IFERROR(J6/K6,\"\")","v":""},{"$f":"IF(R6>0,IF(O6=\"ESTIMEE\",U6,(Q6*P6+R6*U6)/(P6+R6)),Q6)","v":0.96},{"$f":"IFERROR(DISTANCEBANDE(M6,distance),\"\")","v":42},"OFFICIELLE",1,0.96,{"$f":"IFERROR(GETPIVOTDATA(\"Nb parties\",Moyennes_bande,\"Joueur \",$B6),0)","v":0},{"$f":"IFERROR(GETPIVOTDATA(\"Total points\",Moyennes_bande,\"Joueur \",$B6),0)","v":0},{"$f":"IFERROR(GETPIVOTDATA(\"Total reprises\",Moyennes_bande,\"Joueur \",$B6),0)","v":0},{"$f":"IFERROR(S6/T6,\"\")","v":""},{"$f":"IF(AA6>0,IF(X6=\"ESTIMEE\",AD6,(Z6*Y6+AA6*AD6)/(Y6+AA6)),Z6)","v":0.21},{"$f":"IFERROR(DISTANCE3BANDES(V6,distance),\"\")","v":14},"CDBE",1,0.21,{"$f":"IFERROR(GETPIVOTDATA(\"Nb parties\",Moyennes_3bandes,\"Joueur \",$B6),0)","v":0},{"$f":"IFERROR(GETPIVOTDATA(\"Total points\",Moyennes_3bandes,\"Joueur \",$B6),0)","v":0},{"$f":"IFERROR(GETPIVOTDATA(\"Total reprises\",Moyennes_3bandes,\"Joueur \",$B6),0)","v":0},{"$f":"IFERROR(AB6/AC6,\"\")","v":""},{"$f":"IF(AJ6>0,IF(AF6=\"ESTIMEE\",AN6,DISTANCE5Q((AG6+AK6)/(AH6+AL6),distance)),AI6)","v":79},"ESTIMEE",78,null,{"$f":"IF(AH6=\"\",AG6,DISTANCE5Q(AG6/AH6,distance))","v":78},{"$f":"IFERROR(GETPIVOTDATA(\"Nb parties\",Moyennes_5quilles,\"Joueur \",$B6),0)","v":5},{"$f":"IFERROR(GETPIVOTDATA(\"Total points joueur\",Moyennes_5quilles,\"Joueur \",$B6),0)","v":799},{"$f":"IFERROR(GETPIVOTDATA(\"Total points adversaire\",Moyennes_5quilles,\"Joueur \",$B6),0)","v":782},{"$f":"IFERROR(AK6/AL6,\"\")","v":1.0217391304347827},{"$f":"IFERROR(DISTANCE5Q(AM6,distance),\"\")","v":79}]
["MAS","AGUEFF","nouveau joueur",{"$f":"IF(I7>0,IF(F7=\"ESTIMEE\",L7,(H7*G7+I7*L7)/(G7+I7)),H7)","v":0.3},{"$f":"IFERROR(DISTANCELIBRE(D7,table),\"\")","v":31},"OFFICIELLE",1,0.3,null,null,null,null,0,{"$f":"IFERROR(DISTANCEBANDE(M7,distance),\"\")","v":23},"OFFICIELLE",1,0,null,null,null,null,7.0000000000000007E-2,{"$f":"IFERROR(DISTANCE3BANDES(V7,distance),\"\")","v":10},"CDBE",1,7.0000000000000007E-2,0,0,0,{"$f":"IFERROR(AB7/AC7,\"\")","v":""},{"$f":"IF(AJ7>0,IF(AF7=\"ESTIMEE\",AN7,DISTANCE5Q((AG7+AK7)/(AH7+AL7),distance)),AI7)","v":60},"ESTIMEE",60,null,{"$f":"IF(AH7=\"\",AG7,DISTANCE5Q(AG7/AH7,distance))","v":60}]
["MOR","AIRAULT",null,"NC",{"$f":"IFERROR(DISTANCELIBRE(D8,table),\"\")","v":""},null,null,"NC",0,0,0,{"$f":"IFERROR(J8/K8,\"\")","v":""},1.1000000000000001,{"$f":"IFERROR(DISTANCEBANDE(M8,distance),\"\")","v":45},"OFFICIELLE",1,1.1000000000000001,0,0,0,{"$f":"IFERROR(S8/T8,\"\")","v":""},0.44531972789115648,{"$f":"IFERROR(DISTANCE3BANDES(V8,distance),\"\")","v":24},"OFFICIELLE",1,0.438,2,44,98,{"$f":"IFERROR(AB8/AC8,\"\")","v":0.44897959183673469},{"$f":"IF(AJ8>0,IF(AF8=\"ESTIMEE\",AN8,DISTANCE5Q((AG8+AK8)/(AH8+AL8),distance)),AI8)","v":108},"ESTIMEE",92,null,{"$f":"IF(AH8=\"\",AG8,DISTANCE5Q(AG8/AH8,distance))","v":92},1,184,110,{"$f":"IFERROR(AK8/AL8,\"\")","v":1.6727272727272726},{"$f":"IFERROR(DISTANCE5Q(AM8,distance),\"\")","v":108}]
{"$rows_left_out":146}
{"sheet":"Distances","index":6,"n_rows":120,"n_cols":18,"rows_kept":120,"cut":false,"hidden":false,"merged":[[0,0,0,13]]}
["Distances vétérans 2024-2025"]
[]
["Les nombres en rouge correspondent au milieu de chaque catégorie"]
[null,"Libre",null,null,null,null,"Bande",null,null,null,null,"3 Bandes",null,null,null,"5 quilles"]
[]
[null,{"$f":"CONCATENATE(\"d= \",distance_libre_c,\" m² +\",distance_libre_b,\" m +\",distance_libre_a)","v":"d= -1,34 m² +30 m +22"},null,null,null,null,{"$f":"CONCATENATE(\"d= \",distance_bande_c,\" m² +\",distance_bande_b,\" m +\",distance_bande_a)","v":"d= -0,84 m² +21 m +23"},null,null,null,null,{"$f":"CONCATENATE(\"d= \",distance_3bandes_c,\" m² +\",distance_3bandes_b,\" m +\",distance_3bandes_a)","v":"d= 30 m² +23 m +8"},null,null,null,{"$f":"CONCATENATE(\"d= \",distance_quilles_c,\" m² +\",distance_quilles_b,\" m +\",distance_quilles_a)","v":"d= -2 m² +50 m +30"}]
[null,null,"incrément",{"$f":"(distance_quilles_max-distance_quilles_min)/(MAX(B$9:B$120)-MIN(B$9:B$120))","v":4.5045045045045047},null,null,null,"incrément",{"$f":"(distance_quilles_max-distance_quilles_min)/(MAX(G$9:G$120)-MIN(G$9:G$120))","v":19.23076923076923},null,null,null,"incrément",{"$f":"(distance_quilles_max-distance_quilles_min)/(MAX(L$9:L$120)-MIN(L$9:L$120))","v":71.839080459770116}]
["Cat.","m","distance","dist. 5Q",null,"Cat.","m","distance","dist. 5Q",null,"Cat.","m","distance","dist. 5Q",null,"Cat.","m","distance"]
{"$rows_left_out":113}
{"sheet":"Equipes","index":7,"n_rows":131,"n_cols":14,"rows_kept":131,"cut":false,"hidden":false,"merged":[[17,13,17,19],[90,7,90,8],[113,10,113,11],[90,4,90,5],[61,1,61,2],[74,4,74,5],[76,1,76,2],[90,1,90,2],[74,1,74,2],[88,1,88,2],[113,4,113,5],[0,13,0,19],[59,1,59,2],[39,13,39,19],[0,0,0,11],[4,1,4,2],[18,13,18,19],[4,4,4,5],[25,7,25,8],[27,1,27,2],[25,1,25,2],[59,4,59,5],[25,4,25,5],[4,13,4,19],[36,1,36,2],[38,1,38,2],[3,12,3,16],[126,10,126,11],[130,1,130,2],[111,1,111,2],[126,1,126,2],[111,4,111,5],[111,7,111,8],[113,1,113,2],[128,1,128,2],[126,4,126,5]]}
["Liste des équipes engagées pour la saison 2025 / 2026",null,null,null,null,null,null,null,null,null,null,null,null,"Suivi des équipes incomplètes"]
[]
[null,"Equipe 1",null,null,"Equipe 2",null,null,"Equipe 3",null,null,"Remplaçants "]
[null,null,null,null,null,null,null,null,null,null,"(sera affecté à l'équipe pour laquelle il aura fait le premier match)",null,"Une équipe qui ne peut présenter que 3 joueurs est dite incomplète. Ce cas de figure ne sera accepté que 2 fois dans la saison, à la 3ème fois, cette équipe sera déclarée forfait et les points seront alors comptabilisés comme défini au paragraphe 7 du règlement."]
[null,"Equipe 1",null,null,null,null,null,null,null,null,null,null,null,"Matchs Aller équipes incomplètes"]
["Arpajon ",null,null,null,null,null,null,null,null,null,null,null,null,1]
[9095,"Jean Claude DEVILLEBICHOT","104112 I",null,null,null,null,null,null,null,null,null,null,2]
[null,"Daniel GODFIN","179222 G",null,null,null,null,null,null,null,"Daniel GODFIN","179222 G",null,3]
{"$rows_left_out":124}
{"sheet":"Gestion","index":8,"n_rows":40,"n_cols":9,"rows_kept":40,"cut":false,"hidden":true,"merged":[]}
["Calendrier",null,"Liste des clubs à établir en début de saison :"]
["2025-11-18",null,"ARPAJON"]
["2025-11-25",null,"DRAVEIL",null,"INTEGRATION DU RESULTAT : !!! Pensez à COPIER LE RESULTAT à partir de l'onglet FEUILLE DE MATCH "]
["2025-12-02",null,"ETRECHY"]
["2025-12-09",null,"MASSY",null,"Nombre"]
["2025-12-16",null,"MORANGIS1",null,"Type","Total",null,"Dernière journée",{"$f":"MAX(Matchs!A:A)","v":7}]
["2026-01-06",null,"MORANGIS2",null,"Rencontre",27]
["2026-01-13",null,"VIGNEUX1"]
{"$rows_left_out":33}
{"sheet":"nouveaux joueurs","index":9,"n_rows":13,"n_cols":2,"rows_kept":13,"cut":false,"hidden":true,"merged":[[0,0,0,1]]}
["Nouveaux joueurs"]
[]
["ETR","BENOIT"]
["VIG","VENOT"]
["ETR","SAULE"]
["ETR","LEBROT"]
["DRA","HOUDOU"]
["DRA","HUE"]
{"$rows_left_out":6}
{"sheet":"Gestion matchs","index":10,"n_rows":43,"n_cols":16,"rows_kept":43,"cut":false,"hidden":true,"merged":[[8,2,8,6],[31,1,31,7]]}
[null,"Modification d'une partie existante:"]
[null,"1) compléter le n° de journée et le nom des deux équipes"]
[null,"2) charger le résultat"]
[null,"3) modifier le résultat"]
[null,"4) enregistrer les modifications"]
[]
[]
[null,"Numéro journée :","EQUIPE RECEVANTE :",null,null,null,null,null,null,"EQUIPE VISITEUSE :"]
{"$rows_left_out":36}
{"sheet":"Matchs","index":11,"n_rows":325,"n_cols":14,"rows_kept":325,"cut":false,"hidden":true,"merged":[]}
["Journée","Type","Equipe","Joueur ","distance","point","reprise","pt match","Equipe adv","Adversaire","distance","point","reprise","pt match"]
["VETERANT"]
[1,"Rencontre","DRAVEIL - ARPAJON","DRAVEIL",438,380,6,1,null,"ARPAJON",342,334,10,3]
[1,"Points equipes","DRAVEIL",null,438,380,6,1,"ARPAJON",null,342,334,10,3]
[1,"Points equipes","ARPAJON",null,342,334,10,3,"DRAVEIL",null,438,380,6,1]
[1,"Libre","DRAVEIL","LAMPLE",85,85,27,3,"ARPAJON","CUILLERAT",40,32,27,1]
[1,"Bande","DRAVEIL","TAVERNIER",46,38,59,1,"ARPAJON","GODFIN",36,36,59,3]
[1,"3 Bandes","DRAVEIL","MOULAY",25,23,44,1,"ARPAJON","DEVILLEBICHOT",22,22,44,3]
{"$rows_left_out":318}
{"sheet":"Calculs equipes","index":12,"n_rows":66,"n_cols":17,"rows_kept":66,"cut":false,"hidden":true,"merged":[]}
[]
["Nbr rencontres  par équipe"]
[]
["Type","(Plusieurs éléments)"]
[]
["Nombre de Journée","Equipe"]
[null,"MORANGIS1","MORANGIS2","ETRECHY","MASSY","DRAVEIL","ARPAJON","VIGNEUX1","VIGNEUX2"]
["Total",7,7,6,7,6,7,7,7]
{"$rows_left_out":59}
{"sheet":"Calculs joueurs","index":13,"n_rows":32,"n_cols":22,"rows_kept":32,"cut":false,"hidden":true,"merged":[]}
[]
["Résultat joueurs"]
[]
["Type","(Plusieurs éléments)",null,null,null,"Type","(Plusieurs éléments)",null,null,null,null,"Type","(Plusieurs éléments)",null,null,null,null,"Type","(Plusieurs éléments)"]
[]
[null,"Données",null,null,null,null,"Données",null,null,null,null,null,"Données",null,null,null,null,null,"Données"]
["Joueur ","Nb parties","Total points","Total reprises",null,"Joueur ","Nb parties","Total points","Total reprises",null,null,"Joueur ","Nb parties","Total points","Total reprises",null,null,"Joueur ","Nb parties","Total pt match","Total points joueur","Total points adversaire"]
["DELOBEL",1,52,28,null,"FAYT",2,58,79,null,null,"CARON",6,101,290,null,null,"CATALLO",4,8,510,494]
{"$rows_left_out":25}
{"sheet":"Resultat","index":14,"n_rows":33,"n_cols":14,"rows_kept":33,"cut":false,"hidden":false,"merged":[[0,0,0,2],[15,5,15,11],[12,0,12,2]]}
["Zone de travail pour la copie d'une feuille de match"]
[{"$f":"Journee_classement+1","v":8},"Rencontre",{"$f":"CONCATENATE(D2,\" - \",J2)","v":"- - -"},{"$f":"'Feuille-match'!$C$8","v":"-"},{"$f":"E5+2*E6+5*E7+E8+E8","v":{"$error":"#VALUE!"}},{"$f":"F5+2*F6+5*F7+F8+G8","v":0},{"$f":"H5+H6+H7+H8","v":{"$error":"#VALUE!"}},{"$f":"IF(G2>M2,3,IF(G2<M2,1,2))","v":{"$error":"#VALUE!"}},null,{"$f":"'Feuille-match'!$K$8","v":"-"},{"$f":"K5+2*K6+5*K7+K8+K8","v":{"$error":"#VALUE!"}},{"$f":"L5+2*L6+5*L7+L8+M8","v":0},{"$f":"N5+N6+N7+N8","v":{"$error":"#VALUE!"}},{"$f":"IF(M2>G2,3,IF(M2<G2,1,2))","v":{"$error":"#VALUE!"}}]
[8,"Points equipes",{"$f":"D2","v":"-"},null,{"$f":"E2","v":{"$error":"#VALUE!"}},{"$f":"F2","v":0},{"$f":"G2","v":{"$error":"#VALUE!"}},{"$f":"H2","v":{"$error":"#VALUE!"}},{"$f":"J2","v":"-"},null,{"$f":"K2","v":{"$error":"#VALUE!"}},{"$f":"L2","v":0},{"$f":"M2","v":{"$error":"#VALUE!"}},{"$f":"N2","v":{"$error":"#VALUE!"}}]
[8,"Points equipes",{"$f":"J2","v":"-"},null,{"$f":"K2","v":{"$error":"#VALUE!"}},{"$f":"L2","v":0},{"$f":"M2","v":{"$error":"#VALUE!"}},{"$f":"N2","v":{"$error":"#VALUE!"}},{"$f":"D2","v":"-"},null,{"$f":"E2","v":{"$error":"#VALUE!"}},{"$f":"F2","v":0},{"$f":"G2","v":{"$error":"#VALUE!"}},{"$f":"H2","v":{"$error":"#VALUE!"}}]
[8,{"$f":"'Feuille-match'!$B$12","v":"Libre"},{"$f":"$D$2","v":"-"},{"$f":"'Feuille-match'!B13","v":"-"},{"$f":"'Feuille-match'!C13","v":""},{"$f":"'Feuille-match'!D13","v":0},{"$f":"'Feuille-match'!E13","v":0},{"$f":"'Feuille-match'!H13","v":""},{"$f":"$J$2","v":"-"},{"$f":"'Feuille-match'!J13","v":"-"},{"$f":"'Feuille-match'!K13","v":""},{"$f":"'Feuille-match'!L13","v":0},{"$f":"'Feuille-match'!M13","v":0},{"$f":"'Feuille-match'!P13","v":""}]
[8,{"$f":"'Feuille-match'!$B$15","v":"Bande"},{"$f":"$D$2","v":"-"},{"$f":"'Feuille-match'!B16","v":"-"},{"$f":"'Feuille-match'!C16","v":""},{"$f":"'Feuille-match'!D16","v":0},{"$f":"'Feuille-match'!E16","v":0},{"$f":"'Feuille-match'!H16","v":""},{"$f":"$J$2","v":"-"},{"$f":"'Feuille-match'!J16","v":"-"},{"$f":"'Feuille-match'!K16","v":""},{"$f":"'Feuille-match'!L16","v":0},{"$f":"'Feuille-match'!M16","v":0},{"$f":"'Feuille-match'!P16","v":""}]
[8,{"$f":"'Feuille-match'!$B$18","v":"3 Bandes"},{"$f":"$D$2","v":"-"},{"$f":"'Feuille-match'!B19","v":"-"},{"$f":"'Feuille-match'!C19","v":""},{"$f":"'Feuille-match'!D19","v":0},{"$f":"'Feuille-match'!E19","v":0},{"$f":"'Feuille-match'!H19","v":""},{"$f":"$J$2","v":"-"},{"$f":"'Feuille-match'!J19","v":"-"},{"$f":"'Feuille-match'!K19","v":""},{"$f":"'Feuille-match'!L19","v":0},{"$f":"'Feuille-match'!M19","v":0},{"$f":"'Feuille-match'!P19","v":""}]
[8,{"$f":"'Feuille-match'!$B$21","v":"5 Quilles"},{"$f":"$D$2","v":"-"},{"$f":"'Feuille-match'!B22","v":"-"},{"$f":"'Feuille-match'!C22","v":""},{"$f":"'Feuille-match'!D22","v":0},{"$f":"'Feuille-match'!E22","v":0},{"$f":"'Feuille-match'!H22","v":""},{"$f":"$J$2","v":"-"},{"$f":"'Feuille-match'!J22","v":"-"},{"$f":"'Feuille-match'!K22","v":""},{"$f":"'Feuille-match'!L22","v":0},{"$f":"'Feuille-match'!M22","v":0},{"$f":"'Feuille-match'!P22","v":""}]
{"$rows_left_out":26}
{"sheet":"5QUILLES","index":15,"n_rows":130,"n_cols":21,"rows_kept":130,"cut":false,"hidden":false,"merged":[[2,7,2,10]]}
["distance 5 quilles",null,null,{"$f":"CONCATENATE(\"d= \",distance_quilles_c,\" m² +\",distance_quilles_b,\" m +\",distance_quilles_a)","v":"d= -2 m² +50 m +30"}]
[]
[null,"resultats CDBE  saison 2023-2024",null,null,null,null,null,"Ranking FFB 2023-2024 (124 joueurs)",null,null,null,null,"résultats révérants après 13 jours"]
[null,null,"moyenne","points joueurs","points adverses","distance",null,null,"min","max","moyenne top 10",null,"Joueur ","Nb parties","Total pt match","distance eval","Pts Jr","Pts adv","Moyenne pt marqués","% gain","Moyenne"]
["1er","GUERIN",{"$f":"D5/E5","v":1.404494382022472},2000,1424,{"$f":"distance_quilles_a+distance_quilles_b*C5+distance_quilles_c*C5^2","v":96.27951016285823},null,null,{"$f":"MIN(K7:K130)","v":44.492950219999997},{"$f":"MAX(K7:K130)","v":100.93100792},{"$f":"AVERAGE(K7:K16)","v":83.039422823999999},null,"MOREL",4,10,{"$f":"INDEX(Moyennes!$AI$6:$AI$144,MATCH(M5,Joueurs,0))","v":72},634,345,{"$f":"Q5/(2*N5)","v":79.25},{"$f":"(O5-N5)/(N5*2)","v":0.75},{"$f":"Q5/R5","v":1.8376811594202898}]
["2éme","DUVERNOY",{"$f":"D6/E6","v":1.75},1946,1112,111.375,null,null,"Nom-Prénom","Moyenne",null,null,"CATALLO",4,11,{"$f":"INDEX(Moyennes!$AI$6:$AI$144,MATCH(M6,Joueurs,0))","v":62},398,227,{"$f":"Q6/(2*N6)","v":49.75},{"$f":"(O6-N6)/(N6*2)","v":0.875},1.7533039647577093]
["3éme","JOYEZ",1.3654545454545455,1502,1100,94.543795041322326,null,1,"GUERIN",1.1736,{"$f":"distance_quilles_a+distance_quilles_b*J7+distance_quilles_c*J7^2","v":85.925326080000005},null,"ABITBOL",4,12,{"$f":"INDEX(Moyennes!$AI$6:$AI$144,MATCH(M7,Joueurs,0))","v":78},456,273,57,1,1.6703296703296704]
["4éme","LABLANCHE",1.077037037037037,1454,1350,81.531834293552805,null,2,"CARREAU",1.1681999999999999,85.680617519999998,null,"LEGRAND",1,3,{"$f":"INDEX(Moyennes!$AI$6:$AI$144,MATCH(M8,Joueurs,0))","v":66},114,69,57,1,1.6521739130434783]
{"$rows_left_out":122}