{"text_format":"1","workbook":"xlsx","n_sheets":16,"sheets":["Feuille-match","Etiquettes","Classement","Calendrier","moyennes CDBE","Moyennes","Distances","Equipes","Gestion","nouveaux joueurs","Gestion matchs","Matchs","Calculs equipes","Calculs joueurs","Resultat","5QUILLES"],"not_rendered":{"charts":0,"images":0,"macros":1,"external_links":0,"defined_names":49,"comments":1,"pivot_tables":10},"unopened":[],"bounds":{"document_bytes":16777216,"sheet_cells":100000,"rows_first":2000,"rows_last":500,"rows_between":2000,"halvings":0,"cell_chars":16384,"cell_head_chars":4096},"cells_cut":0,"cells_raw":0,"read":"whole","date_system":"1900"}

{"sheet":"Feuille-match","index":0,"n_rows":35,"n_cols":16,"rows_kept":35,"cut":false,"hidden":false,"merged":[[33,2,33,10],[34,1,34,15],[2,3,3,8],[2,9,3,9],[2,10,2,15],[3,10,3,15],[7,2,7,6],[7,10,7,14]]}
[]
[]
[null,{"$f":"CONCATENATE(\"Journée \",Journee_classement+1)","v":"Journée 8"},null,"Ne remplir que\nles cases sur fond blanc",null,null,null,null,null,"Après vos matchs, pensez\nà transmettre ce fichier\naux responsables ci-contre :","veteran@cdbebillard91.fr"]
[null,{"$f":"INDEX(Dates,Journee_classement+1)","v":"2026-01-20"},null,null,null,null,null,null,null,null,"com-sportive@cdbebillard91.fr"]
[null,17]
[]
[]
[null,"EQUIPE RECEVANTE :","-",null,null,null,null,null,null,"EQUIPE VISITEUSE :","-"]
[null,null,null,null,null,null,null,null,null,null,6]
[null,"NOM DES JOUEURS",null,null,null,null,null,null,null,"NOM DES JOUEURS"]
[]
[null,"Libre","distance","pts réal.","reprises","moyenne",null,"pt match",null,"Libre","distance","pts réal.","reprises","moyenne",null,"pt match"]
[null,"-",{"$f":"IFERROR(ROUND(INDEX(Distance_libre,MATCH(B13,Joueurs,0)),0),\"\")","v":""},null,null,{"$f":"IF(E13=\"\",\"\",D13/E13)","v":""},null,{"$f":"IF(D13=0,\"\",IF(C13=D13,IF(K13=L13,2,3),IF(D13<C13,1)))","v":""},null,"-",{"$f":"IFERROR(ROUND(INDEX(Distance_libre,MATCH(J13,Joueurs,0)),0),\"\")","v":""},null,null,{"$f":"IF(M13=\"\",\"\",L13/M13)","v":""},null,{"$f":"IF(L13=0,\"\",IF(K13=L13,IF(D13=C13,2,3),IF(L13<K13,1)))","v":""}]
[]
[null,"Bande","distance","pts réal.","reprises","moyenne",null,"pts match",null,"Bande","distance","pts réal.","reprises","moyenne",null,"pts match"]
[null,"-",{"$f":"IFERROR(ROUND(INDEX(Distance_bande,MATCH(B16,Joueurs,0)),0),\"\")","v":""},null,null,{"$f":"IF(E16=\"\",\"\",D16/E16)","v":""},null,{"$f":"IF(D16=0,\"\",IF(C16=D16,IF(K16=L16,2,3),IF(D16<C16,1)))","v":""},null,"-",{"$f":"IFERROR(ROUND(INDEX(Distance_bande,MATCH(J16,Joueurs,0)),0),\"\")","v":""},null,null,{"$f":"IF(M16=\"\",\"\",L16/M16)","v":""},null,{"$f":"IF(L16=0,\"\",IF(K16=L16,IF(D16=C16,2,3),IF(L16<K16,1)))","v":""}]
[]
[null,"3 Bandes","distance","pts réal.","reprises","moyenne",null,"pts match",null,"3 Bandes","distance","pts réal.","reprises","moyenne",null,"pts match"]
[null,"-",{"$f":"IFERROR(ROUND(INDEX(Distance_3bandes,MATCH(B19,Joueurs,0)),0),\"\")","v":""},null,null,{"$f":"IF(E19=\"\",\"\",D19/E19)","v":""},null,{"$f":"IF(D19=0,\"\",IF(C19=D19,IF(K19=L19,2,3),IF(D19<C19,1)))","v":""},null,"-",{"$f":"IFERROR(ROUND(INDEX(Distance_3bandes,MATCH(J19,Joueurs,0)),0),\"\")","v":""},null,null,{"$f":"IF(M19=\"\",\"\",L19/M19)","v":""},null,{"$f":"IF(L19=0,\"\",IF(K19=L19,IF(D19=C19,2,3),IF(L19<K19,1)))","v":""}]
[]
[null,"5 Quilles","distance","1er set","2nd set",null,null,null,null,"5 Quilles","distance","1er set","2nd set"]
[null,"-",{"$f":"IFERROR(ROUND(INDEX(Distance_5quilles,MATCH(B22,Joueurs,0)),0),\"\")","v":""},null,null,{"$f":"IF(D22=C22,1,0)","v":1},{"$f":"IF(E22=C22,1,0)","v":1},{"$f":"IF(D22=0,\"\",IF(F22+G22=2,3,IF(F22+G22=1,2,1)))","v":""},null,"-",{"$f":"IFERROR(ROUND(INDEX(Distance_5quilles,MATCH(J22,Joueurs,0)),0),\"\")","v":""},null,null,{"$f":"IF(L22=K22,1,0)","v":1},{"$f":"IF(M22=K22,1,0)","v":1},{"$f":"IF(L22=0,\"\",IF(N22+O22=2,3,IF(N22+O22=1,2,1)))","v":""}]
[]
[null,"TOTAUX",{"$f":"IFERROR(SUM(C13+C16+C19+C22),0)","v":0},{"$f":"IFERROR(SUM(D13+D16+D19+D22),0)","v":0},"coef.\nPond.",{"$f":"IFERROR((D13*1+D16*2+D19*5+(D22+E22)*0.5)/(C13*1+C16*2+C19*5+2*C22*0.5),0)","v":0},null,null,null,"TOTAUX",{"$f":"IFERROR(SUM(K13+K16+K19+K22),0)","v":0},{"$f":"IFERROR(SUM(L13+L16+L19+L22),0)","v":0},"coef.\nPond.",{"$f":"IFERROR((L13*1+L16*2+L19*5+(L22+M22)*0.5)/(K13*1+K16*2+K19*5+2*K22*0.5),0)","v":0}]
[]
[null,"points obtenus par l'équipe : >>>>>>>>>>>> >>>>>>>>>>>>>>>>>>>",null,null,null,null,null,{"$f":"IF(H13=\"\",\"\",H13+H16+H19+H22)","v":""},null,"points obtenus par l'équipe : >>>>>>>>>>>> >>>>>>>>>>>>>>>>>>>",null,null,null,null,null,{"$f":"IF(P13=\"\",\"\",P13+P16+P19+P22)","v":""}]
[]
[]
[null,"NOM du CAPITAINE",null,null,"signature",null,null,null,null,"NOM du CAPITAINE",null,null,"signature"]
[]
[]
[null,null,null,null,"X",null,null,null,null,null,null,null,"X"]
[null,19,null,null,null,null,null,null,null,19]
[null,null,"ATTENTION  : >  SI JOUEUR FORFAIT, CLIQUER SUR LE COIN ROUGE!!!"]
[null,"Lorsqu'une équipe est incomplète, l'un des 3 joueurs devra disputer 2 modes de jeu différents. Ce joueur et les modes de jeu qu'il fera seront définis avant le début des matchs par le capitaine de l'équipe incomplète.Ce cas de figure ne sera accepté que 2 fois dans la saison."]

{"sheet":"Etiquettes","index":1,"n_rows":76,"n_cols":8,"rows_kept":76,"cut":false,"hidden":false,"merged":[[0,0,4,6],[0,7,4,8],[5,0,7,6],[5,7,7,8],[10,0,14,6],[10,7,14,8],[15,0,17,6],[15,7,17,8],[20,0,24,6],[20,7,24,8],[25,0,27,6],[25,7,27,8],[30,0,34,6],[30,7,34,8],[35,0,37,6],[35,7,37,8],[40,0,44,6],[40,7,44,8],[45,0,47,6],[45,7,47,8],[50,0,54,6],[50,7,54,8],[55,0,57,6],[55,7,57,8],[75,0,77,6],[75,7,77,8],[60,0,64,6],[60,7,64,8],[65,0,67,6],[65,7,67,8],[70,0,74,6],[70,7,74,8]]}
[{"$f":"'Feuille-match'!C8","v":"-"},null,null,null,null,null,null,{"$f":"'Feuille-match'!C13","v":""}]
[]
[]
[]
[]
[{"$f":"'Feuille-match'!B13","v":"-"},null,null,null,null,null,null,"LIBRE"]
[]
[]
[]
[]
[{"$f":"'Feuille-match'!K8","v":"-"},null,null,null,null,null,null,{"$f":"'Feuille-match'!K13","v":""}]
[]
[]
[]
[]
[{"$f":"'Feuille-match'!J13","v":"-"},null,null,null,null,null,null,"LIBRE"]
[]
[]
[]
[]
[{"$f":"A1","v":"-"},null,null,null,null,null,null,{"$f":"'Feuille-match'!C16","v":""}]
[]
[]
[]
[]
[{"$f":"'Feuille-match'!B16","v":"-"},null,null,null,null,null,null,"BANDE"]
[]
[]
[]
[]
[{"$f":"A11","v":"-"},null,null,null,null,null,null,{"$f":"'Feuille-match'!K16","v":""}]
[]
[]
[]
[]
[{"$f":"'Feuille-match'!J16","v":"-"},null,null,null,null,null,null,"BANDE"]
[]
[]
[]
[]
[{"$f":"A1","v":"-"},null,null,null,null,null,null,{"$f":"'Feuille-match'!C19","v":""}]
[]
[]
[]
[]
[{"$f":"'Feuille-match'!B19","v":"-"},null,null,null,null,null,null,"3 BANDES"]
[]
[]
[]
[]
[{"$f":"A11","v":"-"},null,null,null,null,null,null,{"$f":"'Feuille-match'!K19","v":""}]
[]
[]
[]
[]
[{"$f":"'Feuille-match'!J19","v":"-"},null,null,null,null,null,null,"3 BANDES"]
[]
[]
[]
[]
[{"$f":"A1","v":"-"},null,null,null,null,null,null,{"$f":"'Feuille-match'!C22","v":""}]
[]
[]
[]
[]
[{"$f":"'Feuille-match'!B22","v":"-"},null,null,null,null,null,null,"5 QUILLES"]
[]
[]
[]
[]
[{"$f":"A11","v":"-"},null,null,null,null,null,null,{"$f":"'Feuille-match'!K22","v":""}]
[]
[]
[]
[]
[{"$f":"'Feuille-match'!J22","v":"-"},null,null,null,null,null,null,"5 QUILLES"]

{"sheet":"Classement","index":2,"n_rows":39,"n_cols":15,"rows_kept":39,"cut":false,"hidden":false,"merged":[[0,12,0,14],[2,4,2,7],[15,2,15,4],[15,5,15,7],[17,1,17,4],[18,1,18,4],[19,1,19,4],[20,1,20,4],[21,1,21,4],[22,1,22,4],[23,1,23,4],[24,1,24,4],[34,2,34,11],[35,2,35,11],[36,2,36,11],[28,0,28,14],[29,0,29,14],[30,0,30,14],[31,1,31,11],[32,2,32,11],[33,2,33,11]]}
["CIRCUIT  VETERAN  ESSONNE  2024 / 2025  au :",null,null,null,null,null,null,null,null,null,null,null,{"$f":"IF(Journee_classement>0,INDEX(Dates,Journee_classement),\"\")","v":"2026-01-13"}]
[]
[null,null,null,7,"ème journée"]
[]
[null,"Classement",null,"pts",null,null,"jouées",null,"pour",null,"contre",null,"différence",null,"coefficient"]
[1,{"$f":"'Calculs equipes'!I53","v":"MORANGIS1"},null,{"$f":"'Calculs equipes'!K53","v":18},null,null,{"$f":"'Calculs equipes'!J53","v":7},null,{"$f":"'Calculs equipes'!L53","v":65},null,{"$f":"'Calculs equipes'!M53","v":47},null,{"$f":"'Calculs equipes'!N53","v":18},null,{"$f":"'Calculs equipes'!O53","v":0.93031750491711152}]
[2,{"$f":"'Calculs equipes'!I54","v":"MASSY"},null,{"$f":"'Calculs equipes'!K54","v":17},null,null,{"$f":"'Calculs equipes'!J54","v":7},null,{"$f":"'Calculs equipes'!L54","v":63},null,{"$f":"'Calculs equipes'!M54","v":49},null,{"$f":"'Calculs equipes'!N54","v":14},null,{"$f":"'Calculs equipes'!O54","v":0.85015527950310554}]
[3,{"$f":"'Calculs equipes'!I55","v":"MORANGIS2"},null,{"$f":"'Calculs equipes'!K55","v":17},null,null,{"$f":"'Calculs equipes'!J55","v":7},null,{"$f":"'Calculs equipes'!L55","v":57},null,{"$f":"'Calculs equipes'!M55","v":55},null,{"$f":"'Calculs equipes'!N55","v":2},null,{"$f":"'Calculs equipes'!O55","v":0.85969387755102045}]
[4,{"$f":"'Calculs equipes'!I56","v":"ARPAJON"},null,{"$f":"'Calculs equipes'!K56","v":14},null,null,{"$f":"'Calculs equipes'!J56","v":7},null,{"$f":"'Calculs equipes'!L56","v":56},null,{"$f":"'Calculs equipes'!M56","v":56},null,{"$f":"'Calculs equipes'!N56","v":0},null,{"$f":"'Calculs equipes'!O56","v":0.8951048951048951}]
[5,{"$f":"'Calculs equipes'!I57","v":"VIGNEUX1"},null,{"$f":"'Calculs equipes'!K57","v":13},null,null,{"$f":"'Calculs equipes'!J57","v":7},null,{"$f":"'Calculs equipes'!L57","v":52},null,{"$f":"'Calculs equipes'!M57","v":60},null,{"$f":"'Calculs equipes'!N57","v":-8},null,{"$f":"'Calculs equipes'!O57","v":0.86945636623748213}]
[6,{"$f":"'Calculs equipes'!I58","v":"DRAVEIL"},null,{"$f":"'Calculs equipes'!K58","v":11},null,null,{"$f":"'Calculs equipes'!J58","v":6},null,{"$f":"'Calculs equipes'!L58","v":48},null,{"$f":"'Calculs equipes'!M58","v":48},null,{"$f":"'Calculs equipes'!N58","v":0},null,{"$f":"'Calculs equipes'!O58","v":0.88590021691973975}]
[7,{"$f":"'Calculs equipes'!I59","v":"ETRECHY"},null,{"$f":"'Calculs equipes'!K59","v":10},null,null,{"$f":"'Calculs equipes'!J59","v":6},null,{"$f":"'Calculs equipes'!L59","v":43},null,{"$f":"'Calculs equipes'!M59","v":53},null,{"$f":"'Calculs equipes'!N59","v":-10},null,{"$f":"'Calculs equipes'!O59","v":0.81897682553563622}]
[8,{"$f":"'Calculs equipes'!I60","v":"VIGNEUX2"},null,{"$f":"'Calculs equipes'!K60","v":8},null,null,{"$f":"'Calculs equipes'!J60","v":7},null,{"$f":"'Calculs equipes'!L60","v":48},null,{"$f":"'Calculs equipes'!M60","v":64},null,{"$f":"'Calculs equipes'!N60","v":-16},null,{"$f":"'Calculs equipes'!O60","v":0.78785322648671452}]
[9,{"$f":"'Calculs equipes'!I61","v":"-"},null,{"$f":"'Calculs equipes'!K61","v":0},null,null,{"$f":"'Calculs equipes'!J61","v":""},null,{"$f":"'Calculs equipes'!L61","v":0},null,{"$f":"'Calculs equipes'!M61","v":0},null,{"$f":"'Calculs equipes'!N61","v":0},null,{"$f":"'Calculs equipes'!O61","v":""}]
[]
[null,"Matchs  du  :",{"$f":"INDEX(Dates,D3)","v":"2026-01-13"},null,null,"Résultats"]
[]
[]
[null,"Morangis1 - Vigneux2",null,null,null,null,{"$f":"IFERROR(CONCATENATE(INDEX(Matchs,MATCH(B19,Matchs!C:C,0),7),\" - \",INDEX(Matchs,MATCH(B19,Matchs!C:C,0),13)),\"Non parvenu\")","v":"9 - 7"}]
[]
[null,"Massy - Draveil",null,null,null,null,{"$f":"IFERROR(CONCATENATE(INDEX(Matchs,MATCH(B21,Matchs!C:C,0),7),\" - \",INDEX(Matchs,MATCH(B21,Matchs!C:C,0),13)),\"Non parvenu\")","v":"8 - 8"}]
[]
[null,"Vigneux1 - Etrechy",null,null,null,null,{"$f":"IFERROR(CONCATENATE(INDEX(Matchs,MATCH(B23,Matchs!C:C,0),7),\" - \",INDEX(Matchs,MATCH(B23,Matchs!C:C,0),13)),\"Non parvenu\")","v":"6 - 10"}]
[]
[null,"Arpajon - Morangis2",null,null,null,null,{"$f":"IFERROR(CONCATENATE(INDEX(Matchs,MATCH(B25,Matchs!C:C,0),7),\" - \",INDEX(Matchs,MATCH(B25,Matchs!C:C,0),13)),\"Non parvenu\")","v":"6 - 10"}]
[]
[]
[null,"Prochaine journée ","N°",{"$f":"Journee_classement+1","v":8},"le ",null,{"$f":"INDEX(Dates,D28)","v":"2026-01-20"}]
[]
["Remise des trophées au billard club "]
[]
[null,"RESPONSABLES VETERANS"]
[null,"Arpajon :","Max Thenot"]
[null,"Corbeil :","Anne-Marie Noe"]
[null,"Draveil :","Eric Anne"]
[null,"Massy :","Christian Daniau"]
[null,"Morangis :","Gérard Lablanche, Michel Alexandre"]
[null,"Etréchy","Michel Houplain"]
[null,"Vigneux :","Jérome Helleu"]

{"sheet":"Calendrier","index":3,"n_rows":38,"n_cols":16,"rows_kept":38,"cut":false,"hidden":false,"merged":[[0,0,1,10],[2,0,2,10],[3,0,4,4],[5,0,6,0],[5,1,6,1],[5,10,6,10],[5,3,6,3],[5,5,6,5],[5,7,6,7],[5,9,6,9],[7,7,8,7],[7,9,8,9],[9,3,10,3],[9,5,10,5],[9,7,10,7],[9,9,10,9],[15,0,16,0],[15,1,16,1],[15,10,16,10],[11,0,12,0],[7,0,8,0],[7,1,8,1],[7,10,8,10],[9,0,10,0],[9,1,10,1],[9,10,10,10],[7,3,8,3],[7,5,8,5],[17,0,18,0],[17,1,18,1],[17,10,18,10],[11,1,12,1],[11,10,12,10],[13,0,14,0],[13,1,14,1],[13,10,14,10],[11,3,12,3],[11,5,12,5],[11,7,12,7],[11,9,12,9],[13,3,14,3],[13,5,14,5],[13,7,14,7],[13,9,14,9],[15,3,16,3],[15,5,16,5],[15,7,16,7],[15,9,16,9],[17,3,18,3],[17,5,18,5],[17,7,18,7],[17,9,18,9],[19,0,19,10],[20,0,21,4],[22,10,23,10],[22,0,23,0],[22,1,23,1],[22,3,23,3],[22,5,23,5],[22,7,23,7],[22,9,23,9],[24,0,25,0],[24,1,25,1],[24,10,25,10],[26,0,27,0],[26,1,27,1],[26,10,27,10],[24,5,25,5],[24,7,25,7],[24,9,25,9],[26,3,27,3],[26,5,27,5],[26,7,27,7],[26,9,27,9],[24,3,25,3],[28,0,29,0],[28,1,29,1],[28,10,29,10],[30,0,31,0],[30,1,31,1],[30,10,31,10],[28,3,29,3],[28,5,29,5],[28,7,29,7],[28,9,29,9],[30,3,31,3],[30,5,31,5],[30,7,31,7],[30,9,31,9],[36,0,36,10],[37,0,37,10],[38,0,38,10],[32,0,33,0],[32,1,33,1],[32,10,33,10],[34,0,35,0],[34,1,35,1],[34,10,35,10],[32,3,33,3],[32,5,33,5],[32,7,33,7],[32,9,33,9],[34,3,35,3],[34,5,35,5],[34,7,35,7],[34,9,35,9]]}
["COMITE DEPARTEMENTAL DE BILLARD DE L'ESSONNE"]
[null,null,null,null,null,null,null,null,null,null,null,null,null,null,{"$f":"Gestion!C2","v":"ARPAJON"},{"$f":"COUNTIF($A$1:$K$36,O2)","v":14}]
["CALENDRIER  VETERAN  2025 / 2026",null,null,null,null,null,null,null,null,null,null,null,null,null,{"$f":"Gestion!#REF!","v":{"$error":"#REF!"}},0]
["Matchs Aller",null,null,null,null,null,null,null,null,null,null,null,null,null,{"$f":"Gestion!C3","v":"DRAVEIL"},14]
[null,null,null,null,null,null,null,null,null,null,"Exempt de la journée",null,null,null,{"$f":"Gestion!C4","v":"ETRECHY"},14]
[1,{"$f":"INDEX(Dates,A6)","v":"2025-11-18"},"MORANGIS1","MA","VIGNEUX1","MA","ETRECHY","MA","DRAVEIL","MA",null,null,null,null,{"$f":"Gestion!C5","v":"MASSY"},14]
[null,null,"MORANGIS2",null,"VIGNEUX2",null,"MASSY",null,"ARPAJON",null,null,null,null,null,{"$f":"Gestion!C6","v":"MORANGIS1"},14]
[2,{"$f":"INDEX(Dates,A8)","v":"2025-11-25"},"DRAVEIL","MA","ARPAJON","MA","MASSY","MA","VIGNEUX2","MA",null,null,null,null,{"$f":"Gestion!C7","v":"MORANGIS2"},14]
[null,null,"MORANGIS1",null,"ETRECHY",null,"VIGNEUX1",null,"MORANGIS2",null,null,null,null,null,{"$f":"Gestion!#REF!","v":{"$error":"#REF!"}},0]
[3,{"$f":"INDEX(Dates,A10)","v":"2025-12-02"},"MASSY","MA","MORANGIS2","MA","VIGNEUX2","MA","ETRECHY","MA",null,null,null,null,{"$f":"Gestion!C8","v":"VIGNEUX1"}]
[null,null,"ARPAJON",null,"VIGNEUX1",null,"DRAVEIL",null,"MORANGIS1",null,null,null,null,null,{"$f":"Gestion!C9","v":"VIGNEUX2"}]
[4,{"$f":"INDEX(Dates,A12)","v":"2025-12-09"},"DRAVEIL","MA","VIGNEUX1","MA","ETRECHY","MA","MORANGIS1","MA"]
[null,null,"MORANGIS2",null,"ARPAJON",null,"VIGNEUX2",null,"MASSY"]
[5,{"$f":"INDEX(Dates,A14)","v":"2025-12-16"},"MORANGIS2","MA","VIGNEUX2","MA","ARPAJON","MA","DRAVEIL","MA"]
[null,null,"ETRECHY",null,"MASSY",null,"MORANGIS1",null,"VIGNEUX1"]
[6,{"$f":"INDEX(Dates,A16)","v":"2026-01-06"},"VIGNEUX1","MA","ARPAJON","MA","ETRECHY","MA","MORANGIS2","MA"]
[null,null,"MORANGIS1",null,"VIGNEUX2",null,"DRAVEIL",null,"MASSY"]
[7,{"$f":"INDEX(Dates,A18)","v":"2026-01-13"},"MORANGIS1","MA","MASSY","MA","VIGNEUX1","MA","ARPAJON","MA"]
[null,null,"VIGNEUX2",null,"DRAVEIL",null,"ETRECHY",null,"MORANGIS2"]
["En gras l'équipe qui reçoit - MA = mardi - ME = mercredi"]
["Matchs Retour"]
[null,null,null,null,null,null,null,null,null,null,"Exempt de la journée"]
[8,{"$f":"INDEX(Dates,A23)","v":"2026-01-20"},"MORANGIS2","MA","VIGNEUX2","MA","MASSY","MA","ARPAJON","MA"]
[null,null,"MORANGIS1",null,"VIGNEUX1",null,"ETRECHY",null,"DRAVEIL"]
[9,{"$f":"INDEX(Dates,A25)","v":"2026-01-27"},"MORANGIS1","MA","ETRECHY","MA","VIGNEUX1","MA","MORANGIS2","ME"]
[null,null,"DRAVEIL",null,"ARPAJON",null,"MASSY",null,"VIGNEUX2"]
[10,{"$f":"INDEX(Dates,A27)","v":"2026-02-03"},"ARPAJON","MA","VIGNEUX1","MA","DRAVEIL","MA","MORANGIS1","MA"]
[null,null,"MASSY",null,"MORANGIS2",null,"VIGNEUX2",null,"ETRECHY"]
[11,{"$f":"INDEX(Dates,A29)","v":"2026-02-10"},"MORANGIS2","MA","ARPAJON","MA","VIGNEUX2","MA","MASSY","MA"]
[null,null,"DRAVEIL",null,"VIGNEUX1",null,"ETRECHY",null,"MORANGIS1"]
[12,{"$f":"INDEX(Dates,A31)","v":"2026-02-17"},"ETRECHY","MA","MASSY","MA","MORANGIS1","MA","VIGNEUX1","MA"]
[null,null,"MORANGIS2",null,"VIGNEUX2",null,"ARPAJON",null,"DRAVEIL"]
[13,{"$f":"INDEX(Dates,A33)","v":"2026-03-10"},"MORANGIS1","MA","VIGNEUX2","MA","DRAVEIL","MA","MASSY","MA"]
[null,null,"VIGNEUX1",null,"ARPAJON",null,"ETRECHY",null,"MORANGIS2"]
[14,{"$f":"INDEX(Dates,A35)","v":"2026-03-17"},"VIGNEUX2","MA","DRAVEIL","MA","ETRECHY","MA","MORANGIS2","MA"]
[null,null,"MORANGIS1",null,"MASSY",null,"VIGNEUX1",null,"ARPAJON"]
["envoi des résultats sur : veteran@cdbebillard91.fr"]
["Rencontres le mardi, rendez vous à 14 h 00 début des matchs à 14 h 30"]

{"sheet":"moyennes CDBE","index":4,"n_rows":173,"n_cols":10,"rows_kept":173,"cut":false,"hidden":false,"merged":[[0,0,0,9],[1,0,2,0],[1,1,2,1],[1,2,2,3],[1,4,2,5],[1,6,2,7],[1,8,1,9]]}
["moyennes vétérans en tournoi CDBE 2025/2026"]
["Noms","Prénoms","Libre",null,"1 Bande",null,"3bandes",null,"5 Quilles"]
[null,null,null,null,null,null,null,null,"faits","subis"]
["ALEXANDRE","michel",null,null,10,27,10,36]
[null,null,null,null,25,35,9,40]
[null,null,null,null,48,32,6,40]
[null,null,null,null,null,null,9,25]
[]
[null,null,"moyenne",null,"moyenne",null,"moyenne"]
["ANNE","Eric"]
[]
[]
[]
[]
[null,null,"moyenne",null,"moyenne",null,"moyenne"]
["AIRAULT","Jean Michel"]
[]
[]
[]
[null,null,"moyenne",null,"moyenne",null,"moyenne"]
["BELINGARD","éric",35,23,25,21]
[null,null,48,35,29,34]
[null,null,42,35,30,25]
[]
[null,null,{"$f":"C21+C22+C23","v":125},{"$f":"D21+D22+D23","v":93},{"$f":"E21+E22+E23","v":84},{"$f":"F21+F22+F23","v":80},"moyenne"]
["BRIOIT","bernard",null,null,11,30,8,35]
[null,null,null,null,28,40,6,30]
[null,null,null,null,14,25,6,40]
[null,null,"moyenne",null,"moyenne",null,"moyenne"]
["CARLE","jean paul",null,null,13,29]
[null,null,null,null,20,40]
[null,null,null,null,13,40]
[null,null,"moyenne",null,"moyenne",null,"moyenne"]
["CHAMPAGNE","jean pierre",null,null,null,null,12,45]
[null,null,null,null,null,null,10,30]
[null,null,null,null,null,null,15,44]
[null,null,"moyenne",null,"moyenne",null,"moyenne"]
["DANIAU ","Christian",null,null,35,35]
[null,null,null,null,50,35]
[null,null,null,null,14,35]
[null,null,null,null,45,35]
["DEVILLEBICHOT","jean claude",51,33,30,21,15,22]
[null,null,55,32,30,29,10,45]
[null,null,60,32,30,17,11,37]
[null,null,null,null,19,22,15,45]
["FAYT","bernard",16,12,30,23]
[null,null,60,30,22,31]
[null,null,39,35,21,40]
[null,null,"moyenne",null,"moyenne",null,"moyenne"]
["FERON","jean"]
[]
[]
[null,null,"moyenne",null,"moyenne",null,"moyenne"]
["FLEURY","gérard",20,22,null,null,9,38]
[null,null,28,30,null,null,8,45]
[null,null,39,35,null,null,12,45]
[null,null,"moyenne",null,"moyenne",null,"moyenne"]
["FREYSZ","jean claude",null,null,null,null,15,38]
[null,null,null,null,null,null,15,37]
[null,null,null,null,null,null,15,24]
[null,null,null,null,null,null,8,35]
[]
[]
["GODFIN","daniel",null,null,null,null,8,40]
[null,null,null,null,null,null,6,40]
[null,null,null,null,null,null,7,40]
[null,null,null,null,null,null,10,31]
["HOUPLAIN","michel",null,null,60,17]
[null,null,null,null,40,23]
[null,null,null,null,48,21]
[null,null,"moyenne",null,"moyenne",null,"moyenne"]
["JOYEZ","patrick",75,25,60,26,20,38]
[null,null,80,21,59,27,20,45]
[null,null,80,13,43,17,13,31]
[null,null,80,25,null,null,20,30]
[null,null,"moyenne",null,"moyenne",null,"moyenne"]
["JULLIEN","claude",null,null,40,35]
[null,null,null,null,39,34]
[null,null,null,null,50,30]
[null,null,"moyenne",null,"moyenne",null,"moyenne"]
["LABLANCHE","Gérard"]
[]
[]
[null,null,"moyenne",null,"moyenne",null,"moyenne"]
["LEBROT","guy"]
[]
[]
[null,null,"moyenne",null,"moyenne",null,"moyenne"]
["LESAGE","jean",110,25,39,26,20,42]
[null,null,75,16,44,23,18,45]
[null,null,114,25,60,23,18,30]
[null,null,101,25,null,null,12,30]
["LHOMME","éric",47,24,25,26]
[null,null,45,25,30,35]
[null,null,26,17,48,35]
[null,null,"moyenne",null,"moyenne",null,"moyenne"]
["LILLO ARAYA","Sergio"]
[]
[]
[null,null,"moyenne",null,"moyenne",null,"moyenne"]
["LIOTARD","gilles",60,33,20,31]
[null,null,60,32,23,35]
[null,null,37,26,27,35]
[null,null,31,19]
[null,null,"moyenne",null,"moyenne",null,"moyenne"]
["MIRLAUD","maurice"]
[]
[]
[null,null,"moyenne",null,"moyenne",null,"moyenne"]
["MIRMAN","stéphane",64,25,45,35]
[null,null,35,25,23,35]
[null,null,58,25,36,30]
[null,null,69,25]
["MOREAU","jean louis"]
[]
[]
[]
[null,null,"moyenne",null,"moyenne",null,"moyenne"]
["MOREL","pierre yves"]
[]
[]
[null,null,"moyenne",null,"moyenne",null,"moyenne"]
["MOULAY","didier"]
[]
[]
[]
[null,null,"moyenne",null,"moyenne",null,"moyenne"]
["PAIS","manuel"]
[]
[]
[null,null,"moyenne",null,"moyenne",null,"moyenne"]
["PINTO MONTEIRO","manuel",null,null,null,null,7,37]
[null,null,null,null,null,null,11,45]
[null,null,null,null,null,null,7,45]
[null,null,"moyenne",null,"moyenne",null,"moyenne"]
["PORCU","frédéric",null,null,13,29]
[null,null,null,null,30,34]
[null,null,null,null,17,29]
[null,null,"moyenne",null,"moyenne",null,"moyenne"]
["PRIEUR","jacques",null,null,21,31]
[null,null,null,null,29,40]
[null,null,null,null,15,34]
[null,null,"moyenne",null,"moyenne",null,"moyenne"]
["ROUX","Olivier"]
[]
[]
[]
[null,null,"moyenne",null,"moyenne",null,"moyenne"]
["SERRA","didier",71,19,38,35,10,30]
[null,null,80,21,44,35,10,29]
[null,null,29,13,32,35,10,21]
[null,null,72,25,50,32,12,31]
["TAVERNIER","éric"]
[]
[]
[null,null,"moyenne",null,"moyenne",null,"moyenne"]
["THENOT","max",67,21,36,35]
[null,null,58,25,33,35]
[null,null,68,20,29,30]
[null,null,68,25]
[null,null,"moyenne",null,"moyenne",null,"moyenne"]
["TRUFFAUT","Gérald"]
[]
[]
[null,null,"moyenne",null,"moyenne",null,"moyenne"]
["VERLEY","nicolas",52,35,26,35,10,38]
[null,null,60,30,47,35,20,36]
[null,null,35,35,50,30,20,31]
[null,null,null,null,null,null,16,25]
["VINGUEASSALOM","éric",27,25,42,35,15,36]
[null,null,57,25,43,35,20,29]
[null,null,80,17,38,35,9,45]
[null,null,null,null,39,35,19,36]

{"sheet":"Moyennes","index":5,"n_rows":153,"n_cols":40,"rows_kept":153,"cut":false,"hidden":false,"merged":[[151,1,151,2],[3,26,3,29],[3,5,3,7],[3,14,3,16],[3,23,3,25],[2,0,4,0],[145,0,145,2],[146,0,146,2],[147,0,147,2],[149,0,149,2],[4,42,4,43],[2,1,4,1],[2,3,2,11],[3,3,3,4],[2,30,2,39],[3,35,3,39],[3,8,3,11],[3,17,3,20],[3,12,3,13],[2,12,2,20],[2,21,2,29],[3,21,3,22],[3,31,3,34]]}
[{"$f":"CONCATENATE(\"Moyennes  et  distances  pour  la  journée N°\",Journee_classement+1)","v":"Moyennes  et  distances  pour  la  journée N°8"}]
[null,null,null,2,null,null,null,null,null,null,null,null,4,null,null,null,null,null,null,null,null,6,null,null,null,null,null,null,null,null,30]
["Club","NOM",null,"LIBRE",null,null,null,null,null,null,null,null,"BANDE",null,null,null,null,null,null,null,null,"3  BANDES",null,null,null,null,null,null,null,null,"5 Quilles"]
[null,null,null,{"$f":"CONCATENATE(\"Ranking J\",Journee_classement+1)","v":"Ranking J8"},null,"Ranking initial",null,null,"Résultat vétérants",null,null,null,{"$f":"CONCATENATE(\"Ranking J\",Journee_classement+1)","v":"Ranking J8"},null,"Ranking initial",null,null,"Résultat vétérants",null,null,null,{"$f":"CONCATENATE(\"Ranking J\",Journee_classement+1)","v":"Ranking J8"},null,"Ranking initial",null,null,"Résultat vétérants",null,null,null,{"$f":"CONCATENATE(\"Ranking J\",Journee_classement+1)","v":"Ranking J8"},"Ranking initial",null,null,null,"Résultat vétérants"]
[null,null,null,"moyenne","distance","Source","Nbr match","moyenne","Nbr matchs","points","reprises","moyenne","moyenne","distance","Source","Nbr match","moyenne","Nbr matchs","points","reprises","moyenne","moyenne","distance","Source","Nbr match","moyenne","Nbr matchs","points","reprises","moyenne","distance","Source","Points joueur","Points adversaires","Distance","Nbr matchs","Points joueur","Points adversaires","moyenne","distance"]
["VIG","ABITBOL",null,{"$f":"IF(I6>0,IF(F6=\"ESTIMEE\",L6,(H6*G6+I6*L6)/(G6+I6)),H6)","v":"NC"},{"$f":"IFERROR(DISTANCELIBRE(D6,table),\"\")","v":""},null,null,"NC",{"$f":"IFERROR(GETPIVOTDATA(\"Nb parties\",Moyennes_libre,\"Joueur \",$B6),0)","v":0},{"$f":"IFERROR(GETPIVOTDATA(\"Total points\",Moyennes_libre,\"Joueur \",$B6),0)","v":0},{"$f":"IFERROR(GETPIVOTDATA(\"Total reprises\",Moyennes_libre,\"Joueur \",$B6),0)","v":0},{"$f":"IFERROR(J6/K6,\"\")","v":""},{"$f":"IF(R6>0,IF(O6=\"ESTIMEE\",U6,(Q6*P6+R6*U6)/(P6+R6)),Q6)","v":0.96},{"$f":"IFERROR(DISTANCEBANDE(M6,distance),\"\")","v":42},"OFFICIELLE",1,0.96,{"$f":"IFERROR(GETPIVOTDATA(\"Nb parties\",Moyennes_bande,\"Joueur \",$B6),0)","v":0},{"$f":"IFERROR(GETPIVOTDATA(\"Total points\",Moyennes_bande,\"Joueur \",$B6),0)","v":0},{"$f":"IFERROR(GETPIVOTDATA(\"Total reprises\",Moyennes_bande,\"Joueur \",$B6),0)","v":0},{"$f":"IFERROR(S6/T6,\"\")","v":""},{"$f":"IF(AA6>0,IF(X6=\"ESTIMEE\",AD6,(Z6*Y6+AA6*AD6)/(Y6+AA6)),Z6)","v":0.21},{"$f":"IFERROR(DISTANCE3BANDES(V6,distance),\"\")","v":14},"CDBE",1,0.21,{"$f":"IFERROR(GETPIVOTDATA(\"Nb parties\",Moyennes_3bandes,\"Joueur \",$B6),0)","v":0},{"$f":"IFERROR(GETPIVOTDATA(\"Total points\",Moyennes_3bandes,\"Joueur \",$B6),0)","v":0},{"$f":"IFERROR(GETPIVOTDATA(\"Total reprises\",Moyennes_3bandes,\"Joueur \",$B6),0)","v":0},{"$f":"IFERROR(AB6/AC6,\"\")","v":""},{"$f":"IF(AJ6>0,IF(AF6=\"ESTIMEE\",AN6,DISTANCE5Q((AG6+AK6)/(AH6+AL6),distance)),AI6)","v":79},"ESTIMEE",78,null,{"$f":"IF(AH6=\"\",AG6,DISTANCE5Q(AG6/AH6,distance))","v":78},{"$f":"IFERROR(GETPIVOTDATA(\"Nb parties\",Moyennes_5quilles,\"Joueur \",$B6),0)","v":5},{"$f":"IFERROR(GETPIVOTDATA(\"Total points joueur\",Moyennes_5quilles,\"Joueur \",$B6),0)","v":799},{"$f":"IFERROR(GETPIVOTDATA(\"Total points adversaire\",Moyennes_5quilles,\"Joueur \",$B6),0)","v":782},{"$f":"IFERROR(AK6/AL6,\"\")","v":1.0217391304347827},{"$f":"IFERROR(DISTANCE5Q(AM6,distance),\"\")","v":79}]
["MAS","AGUEFF","nouveau joueur",{"$f":"IF(I7>0,IF(F7=\"ESTIMEE\",L7,(H7*G7+I7*L7)/(G7+I7)),H7)","v":0.3},{"$f":"IFERROR(DISTANCELIBRE(D7,table),\"\")","v":31},"OFFICIELLE",1,0.3,null,null,null,null,0,{"$f":"IFERROR(DISTANCEBANDE(M7,distance),\"\")","v":23},"OFFICIELLE",1,0,null,null,null,null,7.0000000000000007E-2,{"$f":"IFERROR(DISTANCE3BANDES(V7,distance),\"\")","v":10},"CDBE",1,7.0000000000000007E-2,0,0,0,{"$f":"IFERROR(AB7/AC7,\"\")","v":""},{"$f":"IF(AJ7>0,IF(AF7=\"ESTIMEE\",AN7,DISTANCE5Q((AG7+AK7)/(AH7+AL7),distance)),AI7)","v":60},"ESTIMEE",60,null,{"$f":"IF(AH7=\"\",AG7,DISTANCE5Q(AG7/AH7,distance))","v":60}]
["MOR","AIRAULT",null,"NC",{"$f":"IFERROR(DISTANCELIBRE(D8,table),\"\")","v":""},null,null,"NC",0,0,0,{"$f":"IFERROR(J8/K8,\"\")","v":""},1.1000000000000001,{"$f":"IFERROR(DISTANCEBANDE(M8,distance),\"\")","v":45},"OFFICIELLE",1,1.1000000000000001,0,0,0,{"$f":"IFERROR(S8/T8,\"\")","v":""},0.44531972789115648,{"$f":"IFERROR(DISTANCE3BANDES(V8,distance),\"\")","v":24},"OFFICIELLE",1,0.438,2,44,98,{"$f":"IFERROR(AB8/AC8,\"\")","v":0.44897959183673469},{"$f":"IF(AJ8>0,IF(AF8=\"ESTIMEE\",AN8,DISTANCE5Q((AG8+AK8)/(AH8+AL8),distance)),AI8)","v":108},"ESTIMEE",92,null,{"$f":"IF(AH8=\"\",AG8,DISTANCE5Q(AG8/AH8,distance))","v":92},1,184,110,{"$f":"IFERROR(AK8/AL8,\"\")","v":1.6727272727272726},{"$f":"IFERROR(DISTANCE5Q(AM8,distance),\"\")","v":108}]
["DRA","ANNE",null,1.76,{"$f":"IFERROR(DISTANCELIBRE(D9,table),\"\")","v":71},"OFFICIELLE",1,1.76,0,0,0,"",1.1499999999999999,{"$f":"IFERROR(DISTANCEBANDE(M9,distance),\"\")","v":46},"ESTIMEE",1,1.1499999999999999,0,0,0,"",0.25,{"$f":"IFERROR(DISTANCE3BANDES(V9,distance),\"\")","v":16},"CDBE",1,0.25,0,0,0,"",{"$f":"IF(AJ9>0,IF(AF9=\"ESTIMEE\",AN9,DISTANCE5Q((AG9+AK9)/(AH9+AL9),distance)),AI9)","v":85},"ESTIMEE",68,null,{"$f":"IF(AH9=\"\",AG9,DISTANCE5Q(AG9/AH9,distance))","v":68},2,298,256,1.1640625,{"$f":"IFERROR(DISTANCE5Q(AM9,distance),\"\")","v":85}]
["MOR","ALEXANDRE",null,0.93,{"$f":"IFERROR(DISTANCELIBRE(D10,table),\"\")","v":49},"OFFICIELLE",1,0.93,0,0,0,"",1.2,{"$f":"IFERROR(DISTANCEBANDE(M10,distance),\"\")","v":47},"ESTIMEE",1,1.2,0,0,0,{"$f":"IFERROR(S10/T10,\"\")","v":""},0.15,{"$f":"IFERROR(DISTANCE3BANDES(V10,distance),\"\")","v":12},"OFFICIELLE",1,0.15,0,0,0,"",{"$f":"IF(AJ10>0,IF(AF10=\"ESTIMEE\",AN10,DISTANCE5Q((AG10+AK10)/(AH10+AL10),distance)),AI10)","v":95},"ESTIMEE",64,null,{"$f":"IF(AH10=\"\",AG10,DISTANCE5Q(AG10/AH10,distance))","v":64},5,798,577,1.3830155979202774,{"$f":"IFERROR(DISTANCE5Q(AM10,distance),\"\")","v":95}]
["VIG","ANNERON",null,1.2963043478260869,{"$f":"IFERROR(DISTANCELIBRE(D11,table),\"\")","v":59},"OFFICIELLE",1,1.31,1,59,46,1.2826086956521738,0.56000000000000005,{"$f":"IFERROR(DISTANCEBANDE(M11,distance),\"\")","v":34},"OFFICIELLE",1,0.56000000000000005,0,0,0,"",0.13800000000000001,{"$f":"IFERROR(DISTANCE3BANDES(V11,distance),\"\")","v":12},"CDBE",1,0.13800000000000001,0,0,0,"",{"$f":"IF(AJ11>0,IF(AF11=\"ESTIMEE\",AN11,DISTANCE5Q((AG11+AK11)/(AH11+AL11),distance)),AI11)","v":66},"ESTIMEE",66,null,{"$f":"IF(AH11=\"\",AG11,DISTANCE5Q(AG11/AH11,distance))","v":66},0,0,0,"",{"$f":"IFERROR(DISTANCE5Q(AM11,distance),\"\")","v":""}]
["DRA","AUBOUET",{"$f":"IFERROR(IF(MATCH(Moyennes!B12,'nouveaux joueurs'!B:B,0) >1,\"nouveau joueur\",\"\"),\"\")","v":""},0.6,{"$f":"IFERROR(DISTANCELIBRE(D12,table),\"\")","v":40},"OFFICIELLE",1,0.6,0,0,0,"",0.3,{"$f":"IFERROR(DISTANCEBANDE(M12,distance),\"\")","v":29},"OFFICIELLE",1,0.3,0,0,0,{"$f":"IFERROR(S12/T12,\"\")","v":""},0.27,{"$f":"IFERROR(DISTANCE3BANDES(V12,distance),\"\")","v":16},"CDBE",1,0.27,0,0,0,"",{"$f":"IF(AJ12>0,IF(AF12=\"ESTIMEE\",AN12,DISTANCE5Q((AG12+AK12)/(AH12+AL12),distance)),AI12)","v":63},"ESTIMEE",63,null,{"$f":"IF(AH12=\"\",AG12,DISTANCE5Q(AG12/AH12,distance))","v":63},0,0,0,"",{"$f":"IFERROR(DISTANCE5Q(AM12,distance),\"\")","v":""}]
["COR","BAJEUX",{"$f":"IFERROR(IF(MATCH(Moyennes!B13,'nouveaux joueurs'!B:B,0) >1,\"nouveau joueur\",\"\"),\"\")","v":""},0.98,{"$f":"IFERROR(DISTANCELIBRE(D13,table),\"\")","v":50},"CDBE",1,0.98,0,0,0,"",0.5,{"$f":"IFERROR(DISTANCEBANDE(M13,distance),\"\")","v":33},"CDBE",1,0.5,0,0,0,"",0.12,{"$f":"IFERROR(DISTANCE3BANDES(V13,distance),\"\")","v":11},"CDBE",1,0.12,0,0,0,"",{"$f":"IF(AJ13>0,IF(AF13=\"ESTIMEE\",AN13,DISTANCE5Q((AG13+AK13)/(AH13+AL13),distance)),AI13)","v":54},"ESTIMEE",54,null,{"$f":"IF(AH13=\"\",AG13,DISTANCE5Q(AG13/AH13,distance))","v":54},0,0,0,"",{"$f":"IFERROR(DISTANCE5Q(AM13,distance),\"\")","v":""}]
["ETR","BELINGARD",{"$f":"IFERROR(IF(MATCH(Moyennes!B14,'nouveaux joueurs'!B:B,0) >1,\"nouveau joueur\",\"\"),\"\")","v":""},1.29,{"$f":"IFERROR(DISTANCELIBRE(D14,table),\"\")","v":58},"OFFICIELLE",1,1.29,0,0,0,"",0.79,{"$f":"IFERROR(DISTANCEBANDE(M14,distance),\"\")","v":39},"OFFICIELLE",1,0.79,0,0,0,"",0.24299999999999999,{"$f":"IFERROR(DISTANCE3BANDES(V14,distance),\"\")","v":15},"OFFICIELLE",1,0.24299999999999999,0,0,0,"",{"$f":"IF(AJ14>0,IF(AF14=\"ESTIMEE\",AN14,DISTANCE5Q((AG14+AK14)/(AH14+AL14),distance)),AI14)","v":66},"ESTIMEE",66,null,{"$f":"IF(AH14=\"\",AG14,DISTANCE5Q(AG14/AH14,distance))","v":66},0,0,0,"",{"$f":"IFERROR(DISTANCE5Q(AM14,distance),\"\")","v":""}]
["ETR","BENOIT",{"$f":"IFERROR(IF(MATCH(Moyennes!B15,'nouveaux joueurs'!B:B,0) >1,\"nouveau joueur\",\"\"),\"\")","v":"nouveau joueur"},{"$f":"IF(I15>0,IF(F15=\"ESTIMEE\",L15,(H15*G15+I15*L15)/(G15+I15)),H15)","v":1.6547619047619047},{"$f":"IFERROR(DISTANCELIBRE(D15,table),\"\")","v":68},"ESTIMEE",1,1.3,3,139,84,{"$f":"IFERROR(J15/K15,\"\")","v":1.6547619047619047},{"$f":"IF(R15>0,IF(O15=\"ESTIMEE\",U15,(Q15*P15+R15*U15)/(P15+R15)),Q15)","v":0.6},{"$f":"IFERROR(DISTANCEBANDE(M15,distance),\"\")","v":35},"ESTIMEE",1,0.6,0,0,0,{"$f":"IFERROR(S15/T15,\"\")","v":""},{"$f":"IF(AA15>0,IF(X15=\"ESTIMEE\",AD15,(Z15*Y15+AA15*AD15)/(Y15+AA15)),Z15)","v":0.2},{"$f":"IFERROR(DISTANCE3BANDES(V15,distance),\"\")","v":14},"ESTIMEE",1,0.2,0,0,0,{"$f":"IFERROR(AB15/AC15,\"\")","v":""},{"$f":"IF(AJ15>0,IF(AF15=\"ESTIMEE\",AN15,DISTANCE5Q((AG15+AK15)/(AH15+AL15),distance)),AI15)","v":66},"ESTIMEE",66,null,{"$f":"IF(AH15=\"\",AG15,DISTANCE5Q(AG15/AH15,distance))","v":66},0,0,0,{"$f":"IFERROR(AK15/AL15,\"\")","v":""},{"$f":"IFERROR(DISTANCE5Q(AM15,distance),\"\")","v":""}]
["ARP","BERTRAND",{"$f":"IFERROR(IF(MATCH(Moyennes!B16,'nouveaux joueurs'!B:B,0) >1,\"nouveau joueur\",\"\"),\"\")","v":""},1.5,{"$f":"IFERROR(DISTANCELIBRE(D16,table),\"\")","v":64},"CDBE",1,1.5,0,0,0,"",0.75,{"$f":"IFERROR(DISTANCEBANDE(M16,distance),\"\")","v":38},"CDBE",1,0.75,0,0,0,"",0.32400000000000001,{"$f":"IFERROR(DISTANCE3BANDES(V16,distance),\"\")","v":19},"CDBE",1,0.32400000000000001,0,0,0,"",{"$f":"IF(AJ16>0,IF(AF16=\"ESTIMEE\",AN16,DISTANCE5Q((AG16+AK16)/(AH16+AL16),distance)),AI16)","v":75},"ESTIMEE",75,null,{"$f":"IF(AH16=\"\",AG16,DISTANCE5Q(AG16/AH16,distance))","v":75},0,0,0,"",{"$f":"IFERROR(DISTANCE5Q(AM16,distance),\"\")","v":""}]
["VIG","BIDE",{"$f":"IFERROR(IF(MATCH(Moyennes!B17,'nouveaux joueurs'!B:B,0) >1,\"nouveau joueur\",\"\"),\"\")","v":""},1.81,{"$f":"IFERROR(DISTANCELIBRE(D17,table),\"\")","v":72},"OFFICIELLE",1,1.81,0,0,0,"",0.89300884955752213,{"$f":"IFERROR(DISTANCEBANDE(M17,distance),\"\")","v":41},"OFFICIELLE",1,1.21,2,83,113,0.73451327433628322,0.32400000000000001,{"$f":"IFERROR(DISTANCE3BANDES(V17,distance),\"\")","v":19},"CDBE",1,0.32400000000000001,0,0,0,"",{"$f":"IF(AJ17>0,IF(AF17=\"ESTIMEE\",AN17,DISTANCE5Q((AG17+AK17)/(AH17+AL17),distance)),AI17)","v":68},"ESTIMEE",68,null,{"$f":"IF(AH17=\"\",AG17,DISTANCE5Q(AG17/AH17,distance))","v":68},0,0,0,"",{"$f":"IFERROR(DISTANCE5Q(AM17,distance),\"\")","v":""}]
["VIG","BORDIER",{"$f":"IFERROR(IF(MATCH(Moyennes!B18,'nouveaux joueurs'!B:B,0) >1,\"nouveau joueur\",\"\"),\"\")","v":""},2,{"$f":"IFERROR(DISTANCELIBRE(D18,table),\"\")","v":77},"OFFICIELLE",1,2,0,0,0,"",1.1445945945945946,{"$f":"IFERROR(DISTANCEBANDE(M18,distance),\"\")","v":46},"CDBE",1,1.1000000000000001,1,44,37,1.1891891891891893,0.28551753635585969,{"$f":"IFERROR(DISTANCE3BANDES(V18,distance),\"\")","v":17},"CDBE",1,0.31,6,94,334,0.28143712574850299,{"$f":"IF(AJ18>0,IF(AF18=\"ESTIMEE\",AN18,DISTANCE5Q((AG18+AK18)/(AH18+AL18),distance)),AI18)","v":69},"ESTIMEE",69,null,{"$f":"IF(AH18=\"\",AG18,DISTANCE5Q(AG18/AH18,distance))","v":69},0,0,0,"",{"$f":"IFERROR(DISTANCE5Q(AM18,distance),\"\")","v":""}]
["ETR","BRILLAUD",{"$f":"IFERROR(IF(MATCH(Moyennes!B19,'nouveaux joueurs'!B:B,0) >1,\"nouveau joueur\",\"\"),\"\")","v":""},0.5,{"$f":"IFERROR(DISTANCELIBRE(D19,table),\"\")","v":37},"OFFICIELLE",1,0.5,0,0,0,{"$f":"IFERROR(J19/K19,\"\")","v":""},0.3,{"$f":"IFERROR(DISTANCEBANDE(M19,distance),\"\")","v":29},"ESTIMEE",1,0.3,0,0,0,"",0.1,{"$f":"IFERROR(DISTANCE3BANDES(V19,distance),\"\")","v":11},"CDBE",1,0.1,0,0,0,"",{"$f":"IF(AJ19>0,IF(AF19=\"ESTIMEE\",AN19,DISTANCE5Q((AG19+AK19)/(AH19+AL19),distance)),AI19)","v":62},"ESTIMEE",62,null,{"$f":"IF(AH19=\"\",AG19,DISTANCE5Q(AG19/AH19,distance))","v":62},0,0,0,"",{"$f":"IFERROR(DISTANCE5Q(AM19,distance),\"\")","v":""}]
["MAS","BRIOIT",{"$f":"IFERROR(IF(MATCH(Moyennes!B20,'nouveaux joueurs'!B:B,0) >1,\"nouveau joueur\",\"\"),\"\")","v":""},1.5631451612903224,{"$f":"IFERROR(DISTANCELIBRE(D20,table),\"\")","v":66},"OFFICIELLE",1,1.68,3,189,124,1.5241935483870968,0.83,{"$f":"IFERROR(DISTANCEBANDE(M20,distance),\"\")","v":40},"OFFICIELLE",1,0.83,0,0,0,"",0.18,{"$f":"IFERROR(DISTANCE3BANDES(V20,distance),\"\")","v":13},"OFFICIELLE",1,0.18,0,0,0,"",{"$f":"IF(AJ20>0,IF(AF20=\"ESTIMEE\",AN20,DISTANCE5Q((AG20+AK20)/(AH20+AL20),distance)),AI20)","v":68},"ESTIMEE",68,null,{"$f":"IF(AH20=\"\",AG20,DISTANCE5Q(AG20/AH20,distance))","v":68},0,0,0,"",{"$f":"IFERROR(DISTANCE5Q(AM20,distance),\"\")","v":""}]
["MAS","CARLE",{"$f":"IFERROR(IF(MATCH(Moyennes!B21,'nouveaux joueurs'!B:B,0) >1,\"nouveau joueur\",\"\"),\"\")","v":""},0.81,{"$f":"IFERROR(DISTANCELIBRE(D21,table),\"\")","v":45},"OFFICIELLE",1,0.81,0,0,0,"",0.43,{"$f":"IFERROR(DISTANCEBANDE(M21,distance),\"\")","v":32},"OFFICIELLE",1,0.43,0,0,0,"",0.106,{"$f":"IFERROR(DISTANCE3BANDES(V21,distance),\"\")","v":11},"CDBE",1,0.106,0,0,0,"",{"$f":"IF(AJ21>0,IF(AF21=\"ESTIMEE\",AN21,DISTANCE5Q((AG21+AK21)/(AH21+AL21),distance)),AI21)","v":74},"ESTIMEE",64,null,{"$f":"IF(AH21=\"\",AG21,DISTANCE5Q(AG21/AH21,distance))","v":64},6,761,833,0.91356542617046821,{"$f":"IFERROR(DISTANCE5Q(AM21,distance),\"\")","v":74}]
["MAS","CARON",{"$f":"IFERROR(IF(MATCH(Moyennes!B22,'nouveaux joueurs'!B:B,0) >1,\"nouveau joueur\",\"\"),\"\")","v":""},3.44,{"$f":"IFERROR(DISTANCELIBRE(D22,table),\"\")","v":109},"OFFICIELLE",1,3.44,0,0,0,"",1.69,{"$f":"IFERROR(DISTANCEBANDE(M22,distance),\"\")","v":56},"ESTIMEE",1,1.69,0,0,0,"",0.35237931034482756,{"$f":"IFERROR(DISTANCE3BANDES(V22,distance),\"\")","v":20},"CDBE",1,0.377,6,101,290,0.34827586206896549,{"$f":"IF(AJ22>0,IF(AF22=\"ESTIMEE\",AN22,DISTANCE5Q((AG22+AK22)/(AH22+AL22),distance)),AI22)","v":75},"ESTIMEE",75,null,{"$f":"IF(AH22=\"\",AG22,DISTANCE5Q(AG22/AH22,distance))","v":75},0,0,0,"",{"$f":"IFERROR(DISTANCE5Q(AM22,distance),\"\")","v":""}]
["MAS","CASTAINGS",{"$f":"IFERROR(IF(MATCH(Moyennes!B23,'nouveaux joueurs'!B:B,0) >1,\"nouveau joueur\",\"\"),\"\")","v":""},7.05,{"$f":"IFERROR(DISTANCELIBRE(D23,table),\"\")","v":167},"OFFICIELLE",1,7.05,0,0,0,"",1.95,{"$f":"IFERROR(DISTANCEBANDE(M23,distance),\"\")","v":61},"OFFICIELLE",1,1.95,0,0,0,"",0.38100000000000001,{"$f":"IFERROR(DISTANCE3BANDES(V23,distance),\"\")","v":21},"CDBE",1,0.38100000000000001,0,0,0,"",{"$f":"IF(AJ23>0,IF(AF23=\"ESTIMEE\",AN23,DISTANCE5Q((AG23+AK23)/(AH23+AL23),distance)),AI23)","v":92},"ESTIMEE",92,null,{"$f":"IF(AH23=\"\",AG23,DISTANCE5Q(AG23/AH23,distance))","v":92},0,0,0,"",{"$f":"IFERROR(DISTANCE5Q(AM23,distance),\"\")","v":""}]
["VIG","CATALLO",{"$f":"IFERROR(IF(MATCH(Moyennes!B24,'nouveaux joueurs'!B:B,0) >1,\"nouveau joueur\",\"\"),\"\")","v":""},0.4,{"$f":"IFERROR(DISTANCELIBRE(D24,table),\"\")","v":34},"OFFICIELLE",1,0.4,0,0,0,"",0.2,{"$f":"IFERROR(DISTANCEBANDE(M24,distance),\"\")","v":27},"ESTIMEE",1,0.2,0,0,0,"",0.14000000000000001,{"$f":"IFERROR(DISTANCE3BANDES(V24,distance),\"\")","v":12},"CDBE",1,0.14000000000000001,0,0,0,"",{"$f":"IF(AJ24>0,IF(AF24=\"ESTIMEE\",AN24,DISTANCE5Q((AG24+AK24)/(AH24+AL24),distance)),AI24)","v":79},"ESTIMEE",62,null,{"$f":"IF(AH24=\"\",AG24,DISTANCE5Q(AG24/AH24,distance))","v":62},4,510,494,1.0323886639676114,{"$f":"IFERROR(DISTANCE5Q(AM24,distance),\"\")","v":79}]
["MOR","CHAMPAGNE",{"$f":"IFERROR(IF(MATCH(Moyennes!B25,'nouveaux joueurs'!B:B,0) >1,\"nouveau joueur\",\"\"),\"\")","v":""},1.6,{"$f":"IFERROR(DISTANCELIBRE(D25,table),\"\")","v":67},"OFFICIELLE",1,1.6,0,0,0,"",0.8,{"$f":"IFERROR(DISTANCEBANDE(M25,distance),\"\")","v":39},"ESTIMEE",1,0.8,0,0,0,"",0.32312893081761002,{"$f":"IFERROR(DISTANCE3BANDES(V25,distance),\"\")","v":19},"OFFICIELLE",1,0.33500000000000002,5,68,212,0.32075471698113206,{"$f":"IF(AJ25>0,IF(AF25=\"ESTIMEE\",AN25,DISTANCE5Q((AG25+AK25)/(AH25+AL25),distance)),AI25)","v":67},"ESTIMEE",67,null,{"$f":"IF(AH25=\"\",AG25,DISTANCE5Q(AG25/AH25,distance))","v":67},0,0,0,"",{"$f":"IFERROR(DISTANCE5Q(AM25,distance),\"\")","v":""}]
["MOR","CHARLES",{"$f":"IFERROR(IF(MATCH(Moyennes!B26,'nouveaux joueurs'!B:B,0) >1,\"nouveau joueur\",\"\"),\"\")","v":""},1.44,{"$f":"IFERROR(DISTANCELIBRE(D26,table),\"\")","v":62},"CDBE",1,1.44,0,0,0,"",1.06,{"$f":"IFERROR(DISTANCEBANDE(M26,distance),\"\")","v":44},"CDBE",1,1.06,0,0,0,"",0.33,{"$f":"IFERROR(DISTANCE3BANDES(V26,distance),\"\")","v":19},"CDBE",1,0.33,0,0,0,"",{"$f":"IF(AJ26>0,IF(AF26=\"ESTIMEE\",AN26,DISTANCE5Q((AG26+AK26)/(AH26+AL26),distance)),AI26)","v":70},"ESTIMEE",70,null,{"$f":"IF(AH26=\"\",AG26,DISTANCE5Q(AG26/AH26,distance))","v":70},0,0,0,"",{"$f":"IFERROR(DISTANCE5Q(AM26,distance),\"\")","v":""}]
["VIG","COSOLETO",{"$f":"IFERROR(IF(MATCH(Moyennes!B27,'nouveaux joueurs'!B:B,0) >1,\"nouveau joueur\",\"\"),\"\")","v":"nouveau joueur"},{"$f":"IF(I27>0,IF(F27=\"ESTIMEE\",L27,(H27*G27+I27*L27)/(G27+I27)),H27)","v":2},{"$f":"IFERROR(DISTANCELIBRE(D27,table),\"\")","v":77},"OFFICIELLE",1,2,0,0,0,{"$f":"IFERROR(J27/K27,\"\")","v":""},{"$f":"IF(R27>0,IF(O27=\"ESTIMEE\",U27,(Q27*P27+R27*U27)/(P27+R27)),Q27)","v":0.87848101265822787},{"$f":"IFERROR(DISTANCEBANDE(M27,distance),\"\")","v":41},"OFFICIELLE",1,1,4,134,158,{"$f":"IFERROR(S27/T27,\"\")","v":0.84810126582278478},{"$f":"IF(AA27>0,IF(X27=\"ESTIMEE\",AD27,(Z27*Y27+AA27*AD27)/(Y27+AA27)),Z27)","v":0.33750000000000002},{"$f":"IFERROR(DISTANCE3BANDES(V27,distance),\"\")","v":19},"CDBE",1,0.3,1,18,48,{"$f":"IFERROR(AB27/AC27,\"\")","v":0.375},{"$f":"IF(AJ27>0,IF(AF27=\"ESTIMEE\",AN27,DISTANCE5Q((AG27+AK27)/(AH27+AL27),distance)),AI27)","v":69},"ESTIMEE",69,null,{"$f":"IF(AH27=\"\",AG27,DISTANCE5Q(AG27/AH27,distance))","v":69},0,0,0,{"$f":"IFERROR(AK27/AL27,\"\")","v":""},{"$f":"IFERROR(DISTANCE5Q(AM27,distance),\"\")","v":""}]
["MOR","COTILLARD",{"$f":"IFERROR(IF(MATCH(Moyennes!B28,'nouveaux joueurs'!B:B,0) >1,\"nouveau joueur\",\"\"),\"\")","v":""},2.2599999999999998,{"$f":"IFERROR(DISTANCELIBRE(D28,table),\"\")","v":83},"OFFICIELLE",1,2.2599999999999998,0,0,0,"",1.0988034188034188,{"$f":"IFERROR(DISTANCEBANDE(M28,distance),\"\")","v":45},"OFFICIELLE",1,1.04,2,88,78,1.1282051282051282,0.27100000000000002,{"$f":"IFERROR(DISTANCE3BANDES(V28,distance),\"\")","v":16},"CDBE",1,0.27100000000000002,0,0,0,"",{"$f":"IF(AJ28>0,IF(AF28=\"ESTIMEE\",AN28,DISTANCE5Q((AG28+AK28)/(AH28+AL28),distance)),AI28)","v":70},"ESTIMEE",70,null,{"$f":"IF(AH28=\"\",AG28,DISTANCE5Q(AG28/AH28,distance))","v":70},0,0,0,"",{"$f":"IFERROR(DISTANCE5Q(AM28,distance),\"\")","v":""}]
["ARP","CUILLERAT",{"$f":"IFERROR(IF(MATCH(Moyennes!B29,'nouveaux joueurs'!B:B,0) >1,\"nouveau joueur\",\"\"),\"\")","v":"nouveau joueur"},{"$f":"IF(I29>0,IF(F29=\"ESTIMEE\",L29,(H29*G29+I29*L29)/(G29+I29)),H29)","v":0.8693877551020408},{"$f":"IFERROR(DISTANCELIBRE(D29,table),\"\")","v":47},"OFFICIELLE",1,0.6,3,94,98,{"$f":"IFERROR(J29/K29,\"\")","v":0.95918367346938771},{"$f":"IF(R29>0,IF(O29=\"ESTIMEE\",U29,(Q29*P29+R29*U29)/(P29+R29)),Q29)","v":0.45},{"$f":"IFERROR(DISTANCEBANDE(M29,distance),\"\")","v":32},"OFFICIELLE",1,0.45,0,0,0,{"$f":"IFERROR(S29/T29,\"\")","v":""},{"$f":"IF(AA29>0,IF(X29=\"ESTIMEE\",AD29,(Z29*Y29+AA29*AD29)/(Y29+AA29)),Z29)","v":0.18},{"$f":"IFERROR(DISTANCE3BANDES(V29,distance),\"\")","v":13},"CDBE",1,0.18,0,0,0,{"$f":"IFERROR(AB29/AC29,\"\")","v":""},{"$f":"IF(AJ29>0,IF(AF29=\"ESTIMEE\",AN29,DISTANCE5Q((AG29+AK29)/(AH29+AL29),distance)),AI29)","v":63},"ESTIMEE",63,null,{"$f":"IF(AH29=\"\",AG29,DISTANCE5Q(AG29/AH29,distance))","v":63},0,0,0,{"$f":"IFERROR(AK29/AL29,\"\")","v":""},{"$f":"IFERROR(DISTANCE5Q(AM29,distance),\"\")","v":""}]
["MAS","DANIAU",{"$f":"IFERROR(IF(MATCH(Moyennes!B30,'nouveaux joueurs'!B:B,0) >1,\"nouveau joueur\",\"\"),\"\")","v":""},1.62,{"$f":"IFERROR(DISTANCELIBRE(D30,table),\"\")","v":67},"OFFICIELLE",1,1.62,0,0,0,"",0.93655696202531646,{"$f":"IFERROR(DISTANCEBANDE(M30,distance),\"\")","v":42},"OFFICIELLE",1,0.86,4,151,158,0.95569620253164556,0.36518421052631578,{"$f":"IFERROR(DISTANCE3BANDES(V30,distance),\"\")","v":20},"CDBE",1,0.28300000000000003,1,17,38,0.44736842105263158,{"$f":"IF(AJ30>0,IF(AF30=\"ESTIMEE\",AN30,DISTANCE5Q((AG30+AK30)/(AH30+AL30),distance)),AI30)","v":95},"ESTIMEE",67,null,{"$f":"IF(AH30=\"\",AG30,DISTANCE5Q(AG30/AH30,distance))","v":67},1,134,98,1.3673469387755102,{"$f":"IFERROR(DISTANCE5Q(AM30,distance),\"\")","v":95}]
["DRA","DELOBEL",{"$f":"IFERROR(IF(MATCH(Moyennes!B31,'nouveaux joueurs'!B:B,0) >1,\"nouveau joueur\",\"\"),\"\")","v":""},1.6785714285714286,{"$f":"IFERROR(DISTANCELIBRE(D31,table),\"\")","v":69},"OFFICIELLE",1,1.5,1,52,28,1.8571428571428572,0.83,{"$f":"IFERROR(DISTANCEBANDE(M31,distance),\"\")","v":40},"OFFICIELLE",1,0.83,0,0,0,"",0.24399999999999999,{"$f":"IFERROR(DISTANCE3BANDES(V31,distance),\"\")","v":15},"CDBE",1,0.24399999999999999,0,0,0,"",{"$f":"IF(AJ31>0,IF(AF31=\"ESTIMEE\",AN31,DISTANCE5Q((AG31+AK31)/(AH31+AL31),distance)),AI31)","v":67},"ESTIMEE",67,null,{"$f":"IF(AH31=\"\",AG31,DISTANCE5Q(AG31/AH31,distance))","v":67},0,0,0,"",{"$f":"IFERROR(DISTANCE5Q(AM31,distance),\"\")","v":""}]
["MOR","DEPARDIEU",{"$f":"IFERROR(IF(MATCH(Moyennes!B32,'nouveaux joueurs'!B:B,0) >1,\"nouveau joueur\",\"\"),\"\")","v":""},2,{"$f":"IFERROR(DISTANCELIBRE(D32,table),\"\")","v":77},"OFFICIELLE",1,2,0,0,0,"",0.61,{"$f":"IFERROR(DISTANCEBANDE(M32,distance),\"\")","v":35},"OFFICIELLE",1,0.61,0,0,0,"",0.28999999999999998,{"$f":"IFERROR(DISTANCE3BANDES(V32,distance),\"\")","v":17},"CDBE",1,0.28999999999999998,0,0,0,"",{"$f":"IF(AJ32>0,IF(AF32=\"ESTIMEE\",AN32,DISTANCE5Q((AG32+AK32)/(AH32+AL32),distance)),AI32)","v":69},"ESTIMEE",69,null,{"$f":"IF(AH32=\"\",AG32,DISTANCE5Q(AG32/AH32,distance))","v":69},0,0,0,"",{"$f":"IFERROR(DISTANCE5Q(AM32,distance),\"\")","v":""}]
["DRA","DESHAYES",{"$f":"IFERROR(IF(MATCH(Moyennes!B33,'nouveaux joueurs'!B:B,0) >1,\"nouveau joueur\",\"\"),\"\")","v":""},0.66,{"$f":"IFERROR(DISTANCELIBRE(D33,table),\"\")","v":41},"OFFICIELLE",1,0.66,0,0,0,"",0.5,{"$f":"IFERROR(DISTANCEBANDE(M33,distance),\"\")","v":33},"ESTIMEE",1,0.5,0,0,0,"",0.15833333333333333,{"$f":"IFERROR(DISTANCE3BANDES(V33,distance),\"\")","v":12},"CDBE",1,0.15,1,8,48,0.16666666666666666,{"$f":"IF(AJ33>0,IF(AF33=\"ESTIMEE\",AN33,DISTANCE5Q((AG33+AK33)/(AH33+AL33),distance)),AI33)","v":72},"ESTIMEE",68,null,{"$f":"IF(AH33=\"\",AG33,DISTANCE5Q(AG33/AH33,distance))","v":68},1,104,120,0.8666666666666667,{"$f":"IFERROR(DISTANCE5Q(AM33,distance),\"\")","v":72}]
["ARP","DEVILLEBICHOT",{"$f":"IFERROR(IF(MATCH(Moyennes!B34,'nouveaux joueurs'!B:B,0) >1,\"nouveau joueur\",\"\"),\"\")","v":""},1.55,{"$f":"IFERROR(DISTANCELIBRE(D34,table),\"\")","v":65},"OFFICIELLE",1,1.55,0,0,0,"",1.07,{"$f":"IFERROR(DISTANCEBANDE(M34,distance),\"\")","v":45},"OFFICIELLE",1,1.07,0,0,0,"",0.37377659574468086,{"$f":"IFERROR(DISTANCE3BANDES(V34,distance),\"\")","v":21},"OFFICIELLE",1,0.41,3,68,188,0.36170212765957449,{"$f":"IF(AJ34>0,IF(AF34=\"ESTIMEE\",AN34,DISTANCE5Q((AG34+AK34)/(AH34+AL34),distance)),AI34)","v":67},"ESTIMEE",67,null,{"$f":"IF(AH34=\"\",AG34,DISTANCE5Q(AG34/AH34,distance))","v":67},0,0,0,"",{"$f":"IFERROR(DISTANCE5Q(AM34,distance),\"\")","v":""}]
["MOR","FAYT",{"$f":"IFERROR(IF(MATCH(Moyennes!B35,'nouveaux joueurs'!B:B,0) >1,\"nouveau joueur\",\"\"),\"\")","v":""},1.36,{"$f":"IFERROR(DISTANCELIBRE(D35,table),\"\")","v":60},"OFFICIELLE",1,1.36,0,0,0,"",0.76611814345991558,{"$f":"IFERROR(DISTANCEBANDE(M35,distance),\"\")","v":39},"OFFICIELLE",1,0.83,2,58,79,0.73417721518987344,0.19900000000000001,{"$f":"IFERROR(DISTANCE3BANDES(V35,distance),\"\")","v":14},"CDBE",1,0.19900000000000001,0,0,0,"",{"$f":"IF(AJ35>0,IF(AF35=\"ESTIMEE\",AN35,DISTANCE5Q((AG35+AK35)/(AH35+AL35),distance)),AI35)","v":66},"ESTIMEE",66,null,{"$f":"IF(AH35=\"\",AG35,DISTANCE5Q(AG35/AH35,distance))","v":66},0,0,0,"",{"$f":"IFERROR(DISTANCE5Q(AM35,distance),\"\")","v":""}]
["ARP","FERON",{"$f":"IFERROR(IF(MATCH(Moyennes!B36,'nouveaux joueurs'!B:B,0) >1,\"nouveau joueur\",\"\"),\"\")","v":""},1.39,{"$f":"IFERROR(DISTANCELIBRE(D36,table),\"\")","v":61},"CDBE",1,1.39,0,0,0,"",0.6,{"$f":"IFERROR(DISTANCEBANDE(M36,distance),\"\")","v":35},"ESTIMEE",1,0.6,0,0,0,"",0.33300000000000002,{"$f":"IFERROR(DISTANCE3BANDES(V36,distance),\"\")","v":19},"OFFICIELLE",1,0.33300000000000002,0,0,0,"",{"$f":"IF(AJ36>0,IF(AF36=\"ESTIMEE\",AN36,DISTANCE5Q((AG36+AK36)/(AH36+AL36),distance)),AI36)","v":66},"ESTIMEE",66,null,{"$f":"IF(AH36=\"\",AG36,DISTANCE5Q(AG36/AH36,distance))","v":66},0,0,0,"",{"$f":"IFERROR(DISTANCE5Q(AM36,distance),\"\")","v":""}]
["VIG","FEVER",{"$f":"IFERROR(IF(MATCH(Moyennes!B37,'nouveaux joueurs'!B:B,0) >1,\"nouveau joueur\",\"\"),\"\")","v":""},3.15,{"$f":"IFERROR(DISTANCELIBRE(D37,table),\"\")","v":103},"OFFICIELLE",1,3.15,0,0,0,"","NC",{"$f":"IFERROR(DISTANCEBANDE(M37,distance),\"\")","v":""},null,1,"NC",{"$f":"IFERROR(GETPIVOTDATA(\"Nb parties\",Moyennes_bande,\"Joueur \",$B37),0)","v":0},{"$f":"IFERROR(GETPIVOTDATA(\"Total points\",Moyennes_bande,\"Joueur \",$B37),0)","v":0},{"$f":"IFERROR(GETPIVOTDATA(\"Total reprises\",Moyennes_bande,\"Joueur \",$B37),0)","v":0},"",0.41,{"$f":"IFERROR(DISTANCE3BANDES(V37,distance),\"\")","v":22},"OFFICIELLE",1,0.41,{"$f":"IFERROR(GETPIVOTDATA(\"Nb parties\",Moyennes_3bandes,\"Joueur \",$B37),0)","v":0},{"$f":"IFERROR(GETPIVOTDATA(\"Total points\",Moyennes_3bandes,\"Joueur \",$B37),0)","v":0},{"$f":"IFERROR(GETPIVOTDATA(\"Total reprises\",Moyennes_3bandes,\"Joueur \",$B37),0)","v":0},"",{"$f":"IF(AJ37>0,IF(AF37=\"ESTIMEE\",AN37,DISTANCE5Q((AG37+AK37)/(AH37+AL37),distance)),AI37)","v":89},"ESTIMEE",89,null,{"$f":"IF(AH37=\"\",AG37,DISTANCE5Q(AG37/AH37,distance))","v":89},{"$f":"IFERROR(GETPIVOTDATA(\"Nb parties\",Moyennes_5quilles,\"Joueur \",$B37),0)","v":0},{"$f":"IFERROR(GETPIVOTDATA(\"Total points joueur\",Moyennes_5quilles,\"Joueur \",$B37),0)","v":0},{"$f":"IFERROR(GETPIVOTDATA(\"Total points adversaire\",Moyennes_5quilles,\"Joueur \",$B37),0)","v":0},"",{"$f":"IFERROR(DISTANCE5Q(AM37,distance),\"\")","v":""}]
["DRA","FLAIRE",{"$f":"IFERROR(IF(MATCH(Moyennes!B38,'nouveaux joueurs'!B:B,0) >1,\"nouveau joueur\",\"\"),\"\")","v":""},1,{"$f":"IFERROR(DISTANCELIBRE(D38,table),\"\")","v":51},"CDBE",1,1,0,0,0,"",1,{"$f":"IFERROR(DISTANCEBANDE(M38,distance),\"\")","v":43},"CDBE",1,1,0,0,0,"",0.25,{"$f":"IFERROR(DISTANCE3BANDES(V38,distance),\"\")","v":16},"CDBE",1,0.25,0,0,0,"",{"$f":"IF(AJ38>0,IF(AF38=\"ESTIMEE\",AN38,DISTANCE5Q((AG38+AK38)/(AH38+AL38),distance)),AI38)","v":60},"ESTIMEE",60,null,{"$f":"IF(AH38=\"\",AG38,DISTANCE5Q(AG38/AH38,distance))","v":60},0,0,0,"",{"$f":"IFERROR(DISTANCE5Q(AM38,distance),\"\")","v":""}]
["ETR","FLEURY",{"$f":"IFERROR(IF(MATCH(Moyennes!B39,'nouveaux joueurs'!B:B,0) >1,\"nouveau joueur\",\"\"),\"\")","v":""},1.1399999999999999,{"$f":"IFERROR(DISTANCELIBRE(D39,table),\"\")","v":54},"OFFICIELLE",1,1.1399999999999999,0,0,0,"",0.66666666666666663,{"$f":"IFERROR(DISTANCEBANDE(M39,distance),\"\")","v":37},"ESTIMEE",1,0.4,1,20,30,0.66666666666666663,0.29499999999999998,{"$f":"IFERROR(DISTANCE3BANDES(V39,distance),\"\")","v":17},"OFFICIELLE",1,0.29499999999999998,0,0,0,"",{"$f":"IF(AJ39>0,IF(AF39=\"ESTIMEE\",AN39,DISTANCE5Q((AG39+AK39)/(AH39+AL39),distance)),AI39)","v":60},"ESTIMEE",65,null,{"$f":"IF(AH39=\"\",AG39,DISTANCE5Q(AG39/AH39,distance))","v":65},1,47,130,0.36153846153846153,{"$f":"IFERROR(DISTANCE5Q(AM39,distance),\"\")","v":60}]
["ARP","FOURNIER",{"$f":"IFERROR(IF(MATCH(Moyennes!B40,'nouveaux joueurs'!B:B,0) >1,\"nouveau joueur\",\"\"),\"\")","v":""},0.75,{"$f":"IFERROR(DISTANCELIBRE(D40,table),\"\")","v":44},"CDBE",1,0.75,0,0,0,"",0.47,{"$f":"IFERROR(DISTANCEBANDE(M40,distance),\"\")","v":33},"CDBE",1,0.47,0,0,0,"",0.13,{"$f":"IFERROR(DISTANCE3BANDES(V40,distance),\"\")","v":11},"CDBE",1,0.13,0,0,0,"",{"$f":"IF(AJ40>0,IF(AF40=\"ESTIMEE\",AN40,DISTANCE5Q((AG40+AK40)/(AH40+AL40),distance)),AI40)","v":60},"ESTIMEE",60,null,{"$f":"IF(AH40=\"\",AG40,DISTANCE5Q(AG40/AH40,distance))","v":60},0,0,0,"",{"$f":"IFERROR(DISTANCE5Q(AM40,distance),\"\")","v":""}]
["MOR","FREYSZ",{"$f":"IFERROR(IF(MATCH(Moyennes!B41,'nouveaux joueurs'!B:B,0) >1,\"nouveau joueur\",\"\"),\"\")","v":""},0.6,{"$f":"IFERROR(DISTANCELIBRE(D41,table),\"\")","v":40},"CDBE",1,0.6,0,0,0,"",0.5,{"$f":"IFERROR(DISTANCEBANDE(M41,distance),\"\")","v":33},"CDBE",1,0.5,0,0,0,"",0.40100000000000002,{"$f":"IFERROR(DISTANCE3BANDES(V41,distance),\"\")","v":22},"OFFICIELLE",1,0.40100000000000002,0,0,0,"",{"$f":"IF(AJ41>0,IF(AF41=\"ESTIMEE\",AN41,DISTANCE5Q((AG41+AK41)/(AH41+AL41),distance)),AI41)","v":81},"ESTIMEE",81,null,{"$f":"IF(AH41=\"\",AG41,DISTANCE5Q(AG41/AH41,distance))","v":81},0,0,0,"",{"$f":"IFERROR(DISTANCE5Q(AM41,distance),\"\")","v":""}]
["MOR","GAROIS",{"$f":"IFERROR(IF(MATCH(Moyennes!B42,'nouveaux joueurs'!B:B,0) >1,\"nouveau joueur\",\"\"),\"\")","v":""},0.57999999999999996,{"$f":"IFERROR(DISTANCELIBRE(D42,table),\"\")","v":39},"OFFICIELLE",1,0.57999999999999996,0,0,0,"",0.3,{"$f":"IFERROR(DISTANCEBANDE(M42,distance),\"\")","v":29},"ESTIMEE",1,0.3,0,0,0,"",0.2,{"$f":"IFERROR(DISTANCE3BANDES(V42,distance),\"\")","v":14},"CDBE",1,0.2,0,0,0,"",{"$f":"IF(AJ42>0,IF(AF42=\"ESTIMEE\",AN42,DISTANCE5Q((AG42+AK42)/(AH42+AL42),distance)),AI42)","v":69},"ESTIMEE",69,null,{"$f":"IF(AH42=\"\",AG42,DISTANCE5Q(AG42/AH42,distance))","v":69},0,0,0,"",{"$f":"IFERROR(DISTANCE5Q(AM42,distance),\"\")","v":""}]
["ARP","GESLIN",{"$f":"IFERROR(IF(MATCH(Moyennes!B43,'nouveaux joueurs'!B:B,0) >1,\"nouveau joueur\",\"\"),\"\")","v":""},1.72,{"$f":"IFERROR(DISTANCELIBRE(D43,table),\"\")","v":70},"CDBE",1,1.72,0,0,0,"",0.86636363636363634,{"$f":"IFERROR(DISTANCEBANDE(M43,distance),\"\")","v":41},"CDBE",1,0.96,1,34,44,0.77272727272727271,0.38400000000000001,{"$f":"IFERROR(DISTANCE3BANDES(V43,distance),\"\")","v":21},"CDBE",1,0.38400000000000001,0,0,0,"",{"$f":"IF(AJ43>0,IF(AF43=\"ESTIMEE\",AN43,DISTANCE5Q((AG43+AK43)/(AH43+AL43),distance)),AI43)","v":85},"ESTIMEE",60,null,{"$f":"IF(AH43=\"\",AG43,DISTANCE5Q(AG43/AH43,distance))","v":60},1,120,104,1.1538461538461537,{"$f":"IFERROR(DISTANCE5Q(AM43,distance),\"\")","v":85}]
["MAS","GOLDMANN",{"$f":"IFERROR(IF(MATCH(Moyennes!B44,'nouveaux joueurs'!B:B,0) >1,\"nouveau joueur\",\"\"),\"\")","v":""},1.8,{"$f":"IFERROR(DISTANCELIBRE(D44,table),\"\")","v":72},"CDBE",1,1.8,0,0,0,"",1.27,{"$f":"IFERROR(DISTANCEBANDE(M44,distance),\"\")","v":48},"CDBE",1,1.27,0,0,0,"",0.38,{"$f":"IFERROR(DISTANCE3BANDES(V44,distance),\"\")","v":21},"CDBE",1,0.38,0,0,0,"",{"$f":"IF(AJ44>0,IF(AF44=\"ESTIMEE\",AN44,DISTANCE5Q((AG44+AK44)/(AH44+AL44),distance)),AI44)","v":61},"ESTIMEE",61,null,{"$f":"IF(AH44=\"\",AG44,DISTANCE5Q(AG44/AH44,distance))","v":61},0,0,0,"",{"$f":"IFERROR(DISTANCE5Q(AM44,distance),\"\")","v":""}]
["ARP","GODFIN",{"$f":"IFERROR(IF(MATCH(Moyennes!B45,'nouveaux joueurs'!B:B,0) >1,\"nouveau joueur\",\"\"),\"\")","v":""},0.99,{"$f":"IFERROR(DISTANCELIBRE(D45,table),\"\")","v":50},"CDBE",1,0.99,0,0,0,"",0.63257042253521134,{"$f":"IFERROR(DISTANCEBANDE(M45,distance),\"\")","v":36},"OFFICIELLE",1,0.65,3,89,142,0.62676056338028174,0.11099688473520249,{"$f":"IFERROR(DISTANCE3BANDES(V45,distance),\"\")","v":11},"CDBE",1,0.09,2,13,107,0.12149532710280374,{"$f":"IF(AJ45>0,IF(AF45=\"ESTIMEE\",AN45,DISTANCE5Q((AG45+AK45)/(AH45+AL45),distance)),AI45)","v":60},"ESTIMEE",60,null,{"$f":"IF(AH45=\"\",AG45,DISTANCE5Q(AG45/AH45,distance))","v":60},0,0,0,"",{"$f":"IFERROR(DISTANCE5Q(AM45,distance),\"\")","v":""}]
["MOR","GOT",{"$f":"IFERROR(IF(MATCH(Moyennes!B46,'nouveaux joueurs'!B:B,0) >1,\"nouveau joueur\",\"\"),\"\")","v":""},{"$f":"IF(I46>0,IF(F46=\"ESTIMEE\",L46,(H46*G46+I46*L46)/(G46+I46)),H46)","v":0.5},{"$f":"IFERROR(DISTANCELIBRE(D46,table),\"\")","v":37},"OFFICIELLE",1,0.5,0,0,0,{"$f":"IFERROR(J46/K46,\"\")","v":""},{"$f":"IF(R46>0,IF(O46=\"ESTIMEE\",U46,(Q46*P46+R46*U46)/(P46+R46)),Q46)","v":0.30263157894736842},{"$f":"IFERROR(DISTANCEBANDE(M46,distance),\"\")","v":29},"CDBE",1,null,1,23,38,{"$f":"IFERROR(S46/T46,\"\")","v":0.60526315789473684},{"$f":"IF(AA46>0,IF(X46=\"ESTIMEE\",AD46,(Z46*Y46+AA46*AD46)/(Y46+AA46)),Z46)","v":0.25},{"$f":"IFERROR(DISTANCE3BANDES(V46,distance),\"\")","v":16},"OFFICIELLE",1,0.25,0,0,0,{"$f":"IFERROR(AB46/AC46,\"\")","v":""},{"$f":"IF(AJ46>0,IF(AF46=\"ESTIMEE\",AN46,DISTANCE5Q((AG46+AK46)/(AH46+AL46),distance)),AI46)","v":72},"ESTIMEE",60,null,{"$f":"IF(AH46=\"\",AG46,DISTANCE5Q(AG46/AH46,distance))","v":60},4,414,471,{"$f":"IFERROR(AK46/AL46,\"\")","v":0.87898089171974525},{"$f":"IFERROR(DISTANCE5Q(AM46,distance),\"\")","v":72}]
["MOR","GUERIN",{"$f":"IFERROR(IF(MATCH(Moyennes!B47,'nouveaux joueurs'!B:B,0) >1,\"nouveau joueur\",\"\"),\"\")","v":""},8.8699999999999992,{"$f":"IFERROR(DISTANCELIBRE(D47,table),\"\")","v":183},"OFFICIELLE",1,8.8699999999999992,0,0,0,"","NC",{"$f":"IFERROR(DISTANCEBANDE(M47,distance),\"\")","v":""},"CDBE",1,"NC",0,0,0,"",0.65,{"$f":"IFERROR(DISTANCE3BANDES(V47,distance),\"\")","v":36},"OFFICIELLE",1,0.65,0,0,0,"",{"$f":"IF(AJ47>0,IF(AF47=\"ESTIMEE\",AN47,DISTANCE5Q((AG47+AK47)/(AH47+AL47),distance)),AI47)","v":"NC"},"ESTIMEE","NC",null,{"$f":"IF(AH47=\"\",AG47,DISTANCE5Q(AG47/AH47,distance))","v":"NC"},0,0,0,"",{"$f":"IFERROR(DISTANCE5Q(AM47,distance),\"\")","v":""}]
["ARP","GUILLOT",{"$f":"IFERROR(IF(MATCH(Moyennes!B48,'nouveaux joueurs'!B:B,0) >1,\"nouveau joueur\",\"\"),\"\")","v":""},1,{"$f":"IFERROR(DISTANCELIBRE(D48,table),\"\")","v":51},"CDBE",1,1,0,0,0,"",0.5,{"$f":"IFERROR(DISTANCEBANDE(M48,distance),\"\")","v":33},"ESTIMEE",1,0.5,0,0,0,"",0.25,{"$f":"IFERROR(DISTANCE3BANDES(V48,distance),\"\")","v":16},"CDBE",1,0.25,0,0,0,"",{"$f":"IF(AJ48>0,IF(AF48=\"ESTIMEE\",AN48,DISTANCE5Q((AG48+AK48)/(AH48+AL48),distance)),AI48)","v":60},"ESTIMEE",60,null,{"$f":"IF(AH48=\"\",AG48,DISTANCE5Q(AG48/AH48,distance))","v":60},0,0,0,"",{"$f":"IFERROR(DISTANCE5Q(AM48,distance),\"\")","v":""}]
["VIG","HELLEU",{"$f":"IFERROR(IF(MATCH(Moyennes!B49,'nouveaux joueurs'!B:B,0) >1,\"nouveau joueur\",\"\"),\"\")","v":""},1.6153656869446344,{"$f":"IFERROR(DISTANCELIBRE(D49,table),\"\")","v":67},"OFFICIELLE",1,1.92,6,327,209,1.5645933014354068,0.8,{"$f":"IFERROR(DISTANCEBANDE(M49,distance),\"\")","v":39},"ESTIMEE",1,0.8,0,0,0,"",0.25,{"$f":"IFERROR(DISTANCE3BANDES(V49,distance),\"\")","v":16},"CDBE",1,0.25,0,0,0,"",{"$f":"IF(AJ49>0,IF(AF49=\"ESTIMEE\",AN49,DISTANCE5Q((AG49+AK49)/(AH49+AL49),distance)),AI49)","v":65},"ESTIMEE",65,null,{"$f":"IF(AH49=\"\",AG49,DISTANCE5Q(AG49/AH49,distance))","v":65},0,0,0,"",{"$f":"IFERROR(DISTANCE5Q(AM49,distance),\"\")","v":""}]
["DRA","HOUDOU",{"$f":"IFERROR(IF(MATCH(Moyennes!B50,'nouveaux joueurs'!B:B,0) >1,\"nouveau joueur\",\"\"),\"\")","v":"nouveau joueur"},{"$f":"IF(I50>0,IF(F50=\"ESTIMEE\",L50,(H50*G50+I50*L50)/(G50+I50)),H50)","v":0.5},{"$f":"IFERROR(DISTANCELIBRE(D50,table),\"\")","v":37},"OFFICIELLE",1,0.5,0,0,0,{"$f":"IFERROR(J50/K50,\"\")","v":""},{"$f":"IF(R50>0,IF(O50=\"ESTIMEE\",U50,(Q50*P50+R50*U50)/(P50+R50)),Q50)","v":0.5},{"$f":"IFERROR(DISTANCEBANDE(M50,distance),\"\")","v":33},"OFFICIELLE",1,0.5,0,0,0,{"$f":"IFERROR(S50/T50,\"\")","v":""},{"$f":"IF(AA50>0,IF(X50=\"ESTIMEE\",AD50,(Z50*Y50+AA50*AD50)/(Y50+AA50)),Z50)","v":0.2},{"$f":"IFERROR(DISTANCE3BANDES(V50,distance),\"\")","v":14},"OFFICIELLE",1,0.2,0,0,0,{"$f":"IFERROR(AB50/AC50,\"\")","v":""},{"$f":"IF(AJ50>0,IF(AF50=\"ESTIMEE\",AN50,DISTANCE5Q((AG50+AK50)/(AH50+AL50),distance)),AI50)","v":62},"ESTIMEE",62,null,{"$f":"IF(AH50=\"\",AG50,DISTANCE5Q(AG50/AH50,distance))","v":62},0,0,0,{"$f":"IFERROR(AK50/AL50,\"\")","v":""},{"$f":"IFERROR(DISTANCE5Q(AM50,distance),\"\")","v":""}]
["ETR","HOUPLAIN",{"$f":"IFERROR(IF(MATCH(Moyennes!B51,'nouveaux joueurs'!B:B,0) >1,\"nouveau joueur\",\"\"),\"\")","v":""},5,{"$f":"IFERROR(DISTANCELIBRE(D51,table),\"\")","v":138},"OFFICIELLE",1,5,0,0,0,"",1.5140366972477062,{"$f":"IFERROR(DISTANCEBANDE(M51,distance),\"\")","v":53},"OFFICIELLE",1,1.68,3,159,109,1.4587155963302751,0.39500000000000002,{"$f":"IFERROR(DISTANCE3BANDES(V51,distance),\"\")","v":22},"OFFICIELLE",1,0.39500000000000002,0,0,0,"",{"$f":"IF(AJ51>0,IF(AF51=\"ESTIMEE\",AN51,DISTANCE5Q((AG51+AK51)/(AH51+AL51),distance)),AI51)","v":83},"ESTIMEE",83,null,{"$f":"IF(AH51=\"\",AG51,DISTANCE5Q(AG51/AH51,distance))","v":83},0,0,0,"",{"$f":"IFERROR(DISTANCE5Q(AM51,distance),\"\")","v":""}]
["DRA","HUE",{"$f":"IFERROR(IF(MATCH(Moyennes!B52,'nouveaux joueurs'!B:B,0) >1,\"nouveau joueur\",\"\"),\"\")","v":"nouveau joueur"},{"$f":"IF(I52>0,IF(F52=\"ESTIMEE\",L52,(H52*G52+I52*L52)/(G52+I52)),H52)","v":0.5},{"$f":"IFERROR(DISTANCELIBRE(D52,table),\"\")","v":37},"CDBE",1,0.5,0,0,0,{"$f":"IFERROR(J52/K52,\"\")","v":""},{"$f":"IF(R52>0,IF(O52=\"ESTIMEE\",U52,(Q52*P52+R52*U52)/(P52+R52)),Q52)","v":0.5},{"$f":"IFERROR(DISTANCEBANDE(M52,distance),\"\")","v":33},"CDBE",1,0.5,0,0,0,{"$f":"IFERROR(S52/T52,\"\")","v":""},{"$f":"IF(AA52>0,IF(X52=\"ESTIMEE\",AD52,(Z52*Y52+AA52*AD52)/(Y52+AA52)),Z52)","v":0.26279069767441865},{"$f":"IFERROR(DISTANCE3BANDES(V52,distance),\"\")","v":16},"CDBE",1,0.2,1,14,43,{"$f":"IFERROR(AB52/AC52,\"\")","v":0.32558139534883723},{"$f":"IF(AJ52>0,IF(AF52=\"ESTIMEE\",AN52,DISTANCE5Q((AG52+AK52)/(AH52+AL52),distance)),AI52)","v":74},"ESTIMEE",60,null,{"$f":"IF(AH52=\"\",AG52,DISTANCE5Q(AG52/AH52,distance))","v":60},2,213,234,{"$f":"IFERROR(AK52/AL52,\"\")","v":0.91025641025641024},{"$f":"IFERROR(DISTANCE5Q(AM52,distance),\"\")","v":74}]
["DRA","HUIBAN",{"$f":"IFERROR(IF(MATCH(Moyennes!B53,'nouveaux joueurs'!B:B,0) >1,\"nouveau joueur\",\"\"),\"\")","v":""},0.5,{"$f":"IFERROR(DISTANCELIBRE(D53,table),\"\")","v":37},"CDBE",1,0.5,0,0,0,"",0.5,{"$f":"IFERROR(DISTANCEBANDE(M53,distance),\"\")","v":33},"CDBE",1,0.5,0,0,0,"",0.2,{"$f":"IFERROR(DISTANCE3BANDES(V53,distance),\"\")","v":14},"CDBE",1,0.2,0,0,0,"",{"$f":"IF(AJ53>0,IF(AF53=\"ESTIMEE\",AN53,DISTANCE5Q((AG53+AK53)/(AH53+AL53),distance)),AI53)","v":62},"ESTIMEE",62,null,{"$f":"IF(AH53=\"\",AG53,DISTANCE5Q(AG53/AH53,distance))","v":62},0,0,0,"",{"$f":"IFERROR(DISTANCE5Q(AM53,distance),\"\")","v":""}]
["ETR","IZNEROWICZ",{"$f":"IFERROR(IF(MATCH(Moyennes!B54,'nouveaux joueurs'!B:B,0) >1,\"nouveau joueur\",\"\"),\"\")","v":""},1.9,{"$f":"IFERROR(DISTANCELIBRE(D54,table),\"\")","v":74},"OFFICIELLE",1,1.9,0,0,0,"",1.03,{"$f":"IFERROR(DISTANCEBANDE(M54,distance),\"\")","v":44},"OFFICIELLE",1,1.03,0,0,0,"",0.15,{"$f":"IFERROR(DISTANCE3BANDES(V54,distance),\"\")","v":12},"CDBE",1,0.15,0,0,0,"",{"$f":"IF(AJ54>0,IF(AF54=\"ESTIMEE\",AN54,DISTANCE5Q((AG54+AK54)/(AH54+AL54),distance)),AI54)","v":60},"ESTIMEE",60,null,{"$f":"IF(AH54=\"\",AG54,DISTANCE5Q(AG54/AH54,distance))","v":60},0,0,0,"",{"$f":"IFERROR(DISTANCE5Q(AM54,distance),\"\")","v":""}]
["ARP","JACQUIN",{"$f":"IFERROR(IF(MATCH(Moyennes!B55,'nouveaux joueurs'!B:B,0) >1,\"nouveau joueur\",\"\"),\"\")","v":""},0.8,{"$f":"IFERROR(DISTANCELIBRE(D55,table),\"\")","v":45},"CDBE",1,0.8,0,0,0,"",0.45208333333333328,{"$f":"IFERROR(DISTANCEBANDE(M55,distance),\"\")","v":32},"CDBE",1,0.3,1,29,48,0.60416666666666663,0.1,{"$f":"IFERROR(DISTANCE3BANDES(V55,distance),\"\")","v":11},"CDBE",1,0.1,0,0,0,"",{"$f":"IF(AJ55>0,IF(AF55=\"ESTIMEE\",AN55,DISTANCE5Q((AG55+AK55)/(AH55+AL55),distance)),AI55)","v":86},"ESTIMEE",64,null,64,2,251,214,1.1728971962616823,{"$f":"IFERROR(DISTANCE5Q(AM55,distance),\"\")","v":86}]
["DRA","JOREAU",{"$f":"IFERROR(IF(MATCH(Moyennes!B56,'nouveaux joueurs'!B:B,0) >1,\"nouveau joueur\",\"\"),\"\")","v":""},0.80909090909090908,{"$f":"IFERROR(DISTANCELIBRE(D56,table),\"\")","v":45},"CDBE",1,0.8,1,18,22,0.81818181818181823,0.5,{"$f":"IFERROR(DISTANCEBANDE(M56,distance),\"\")","v":33},"CDBE",1,0.5,0,0,0,"",0.15,{"$f":"IFERROR(DISTANCE3BANDES(V56,distance),\"\")","v":12},"CDBE",1,0.15,0,0,0,"",{"$f":"IF(AJ56>0,IF(AF56=\"ESTIMEE\",AN56,DISTANCE5Q((AG56+AK56)/(AH56+AL56),distance)),AI56)","v":65},"ESTIMEE",60,null,{"$f":"IF(AH56=\"\",AG56,DISTANCE5Q(AG56/AH56,distance))","v":60},2,205,281,0.72953736654804269,{"$f":"IFERROR(DISTANCE5Q(AM56,distance),\"\")","v":65}]
["MAS","JOYEZ",{"$f":"IFERROR(IF(MATCH(Moyennes!B57,'nouveaux joueurs'!B:B,0) >1,\"nouveau joueur\",\"\"),\"\")","v":""},4.6900000000000004,{"$f":"IFERROR(DISTANCELIBRE(D57,table),\"\")","v":133},"OFFICIELLE",1,4.6900000000000004,0,0,0,"",2.12,{"$f":"IFERROR(DISTANCEBANDE(M57,distance),\"\")","v":64},"OFFICIELLE",1,2.12,0,0,0,"",0.496,{"$f":"IFERROR(DISTANCE3BANDES(V57,distance),\"\")","v":27},"OFFICIELLE",1,0.496,0,0,0,"",{"$f":"IF(AJ57>0,IF(AF57=\"ESTIMEE\",AN57,DISTANCE5Q((AG57+AK57)/(AH57+AL57),distance)),AI57)","v":96},"ESTIMEE",96,null,{"$f":"IF(AH57=\"\",AG57,DISTANCE5Q(AG57/AH57,distance))","v":96},0,0,0,"",{"$f":"IFERROR(DISTANCE5Q(AM57,distance),\"\")","v":""}]
["MOR","JULLIEN",{"$f":"IFERROR(IF(MATCH(Moyennes!B58,'nouveaux joueurs'!B:B,0) >1,\"nouveau joueur\",\"\"),\"\")","v":""},2,{"$f":"IFERROR(DISTANCELIBRE(D58,table),\"\")","v":77},"ESTIMEE",1,2,0,0,0,"",1.47,{"$f":"IFERROR(DISTANCEBANDE(M58,distance),\"\")","v":52},"OFFICIELLE",1,1.47,0,0,0,"",0.47299999999999998,{"$f":"IFERROR(DISTANCE3BANDES(V58,distance),\"\")","v":26},"OFFICIELLE",1,0.47299999999999998,0,0,0,"",{"$f":"IF(AJ58>0,IF(AF58=\"ESTIMEE\",AN58,DISTANCE5Q((AG58+AK58)/(AH58+AL58),distance)),AI58)","v":63},"ESTIMEE",63,null,{"$f":"IF(AH58=\"\",AG58,DISTANCE5Q(AG58/AH58,distance))","v":63},0,0,0,"",{"$f":"IFERROR(DISTANCE5Q(AM58,distance),\"\")","v":""}]
["MOR","LABLANCHE",{"$f":"IFERROR(IF(MATCH(Moyennes!B59,'nouveaux joueurs'!B:B,0) >1,\"nouveau joueur\",\"\"),\"\")","v":""},1.2,{"$f":"IFERROR(DISTANCELIBRE(D59,table),\"\")","v":56},"ESTIMEE",1,1.2,0,0,0,"",0.54,{"$f":"IFERROR(DISTANCEBANDE(M59,distance),\"\")","v":34},"OFFICIELLE",1,0.54,0,0,0,"",0.25,{"$f":"IFERROR(DISTANCE3BANDES(V59,distance),\"\")","v":16},"CDBE",1,0.25,0,0,0,"",{"$f":"IF(AJ59>0,IF(AF59=\"ESTIMEE\",AN59,DISTANCE5Q((AG59+AK59)/(AH59+AL59),distance)),AI59)","v":68},"ESTIMEE",68,null,{"$f":"IF(AH59=\"\",AG59,DISTANCE5Q(AG59/AH59,distance))","v":68},0,0,0,"",{"$f":"IFERROR(DISTANCE5Q(AM59,distance),\"\")","v":""}]
["DRA","LAMPLE",{"$f":"IFERROR(IF(MATCH(Moyennes!B60,'nouveaux joueurs'!B:B,0) >1,\"nouveau joueur\",\"\"),\"\")","v":""},2.7440740740740743,{"$f":"IFERROR(DISTANCELIBRE(D60,table),\"\")","v":94},"OFFICIELLE",1,2.34,1,85,27,3.1481481481481484,1.1000000000000001,{"$f":"IFERROR(DISTANCEBANDE(M60,distance),\"\")","v":45},"ESTIMEE",1,1.1000000000000001,0,0,0,"",0.2016949152542373,{"$f":"IFERROR(DISTANCE3BANDES(V60,distance),\"\")","v":14},"CDBE",1,0.2,1,12,59,0.20338983050847459,{"$f":"IF(AJ60>0,IF(AF60=\"ESTIMEE\",AN60,DISTANCE5Q((AG60+AK60)/(AH60+AL60),distance)),AI60)","v":71},"ESTIMEE",71,null,{"$f":"IF(AH60=\"\",AG60,DISTANCE5Q(AG60/AH60,distance))","v":71},0,0,0,"",{"$f":"IFERROR(DISTANCE5Q(AM60,distance),\"\")","v":""}]
["MOR","LANGLAIS",{"$f":"IFERROR(IF(MATCH(Moyennes!B61,'nouveaux joueurs'!B:B,0) >1,\"nouveau joueur\",\"\"),\"\")","v":""},"NC",{"$f":"IFERROR(DISTANCELIBRE(D61,table),\"\")","v":""},"CDBE",1,"NC",0,0,0,"",1.39,{"$f":"IFERROR(DISTANCEBANDE(M61,distance),\"\")","v":51},"CDBE",1,1.39,0,0,0,"",0.49,{"$f":"IFERROR(DISTANCE3BANDES(V61,distance),\"\")","v":26},"CDBE",1,0.49,0,0,0,"",{"$f":"IF(AJ61>0,IF(AF61=\"ESTIMEE\",AN61,DISTANCE5Q((AG61+AK61)/(AH61+AL61),distance)),AI61)","v":70},"ESTIMEE",70,null,{"$f":"IF(AH61=\"\",AG61,DISTANCE5Q(AG61/AH61,distance))","v":70},0,0,0,"",{"$f":"IFERROR(DISTANCE5Q(AM61,distance),\"\")","v":""}]
["DRA","LAUTI",{"$f":"IFERROR(IF(MATCH(Moyennes!B62,'nouveaux joueurs'!B:B,0) >1,\"nouveau joueur\",\"\"),\"\")","v":""},1.3,{"$f":"IFERROR(DISTANCELIBRE(D62,table),\"\")","v":59},"CDBE",1,1.3,0,0,0,"",0.8,{"$f":"IFERROR(DISTANCEBANDE(M62,distance),\"\")","v":39},"OFFICIELLE",1,0.8,0,0,0,"",0.2,{"$f":"IFERROR(DISTANCE3BANDES(V62,distance),\"\")","v":14},"CDBE",1,0.2,0,0,0,"",{"$f":"IF(AJ62>0,IF(AF62=\"ESTIMEE\",AN62,DISTANCE5Q((AG62+AK62)/(AH62+AL62),distance)),AI62)","v":60},"ESTIMEE",60,null,{"$f":"IF(AH62=\"\",AG62,DISTANCE5Q(AG62/AH62,distance))","v":60},0,0,0,"",{"$f":"IFERROR(DISTANCE5Q(AM62,distance),\"\")","v":""}]
["DRA","LE SAGE",{"$f":"IFERROR(IF(MATCH(Moyennes!B63,'nouveaux joueurs'!B:B,0) >1,\"nouveau joueur\",\"\"),\"\")","v":""},4.3899999999999997,{"$f":"IFERROR(DISTANCELIBRE(D63,table),\"\")","v":128},"CDBE",1,4.3899999999999997,0,0,0,"",1.98,{"$f":"IFERROR(DISTANCEBANDE(M63,distance),\"\")","v":61},"CDBE",1,1.98,0,0,0,"",0.46200000000000002,{"$f":"IFERROR(DISTANCE3BANDES(V63,distance),\"\")","v":25},"CDBE",1,0.46200000000000002,0,0,0,"",{"$f":"IF(AJ63>0,IF(AF63=\"ESTIMEE\",AN63,DISTANCE5Q((AG63+AK63)/(AH63+AL63),distance)),AI63)","v":80},"ESTIMEE",80,null,{"$f":"IF(AH63=\"\",AG63,DISTANCE5Q(AG63/AH63,distance))","v":80},0,0,0,"",{"$f":"IFERROR(DISTANCE5Q(AM63,distance),\"\")","v":""}]
["ETR","LEBROT",{"$f":"IFERROR(IF(MATCH(Moyennes!B64,'nouveaux joueurs'!B:B,0) >1,\"nouveau joueur\",\"\"),\"\")","v":"nouveau joueur"},0.80797872340425525,{"$f":"IFERROR(DISTANCELIBRE(D64,table),\"\")","v":45},"OFFICIELLE",1,0.85,1,36,47,0.76595744680851063,0.4,{"$f":"IFERROR(DISTANCEBANDE(M64,distance),\"\")","v":31},"ESTIMEE",1,0.4,0,0,0,"",0.15,{"$f":"IFERROR(DISTANCE3BANDES(V64,distance),\"\")","v":12},"CDBE",1,0.15,0,0,0,"",{"$f":"IF(AJ64>0,IF(AF64=\"ESTIMEE\",AN64,DISTANCE5Q((AG64+AK64)/(AH64+AL64),distance)),AI64)","v":60},"ESTIMEE",60,null,{"$f":"IF(AH64=\"\",AG64,DISTANCE5Q(AG64/AH64,distance))","v":60},0,0,0,"",{"$f":"IFERROR(DISTANCE5Q(AM64,distance),\"\")","v":""}]
["MOR","LEBRUN",{"$f":"IFERROR(IF(MATCH(Moyennes!B65,'nouveaux joueurs'!B:B,0) >1,\"nouveau joueur\",\"\"),\"\")","v":""},0.96,{"$f":"IFERROR(DISTANCELIBRE(D65,table),\"\")","v":50},"OFFICIELLE",1,0.96,0,0,0,"",0.63,{"$f":"IFERROR(DISTANCEBANDE(M65,distance),\"\")","v":36},"OFFICIELLE",1,0.63,0,0,0,"",0.245,{"$f":"IFERROR(DISTANCE3BANDES(V65,distance),\"\")","v":15},"CDBE",1,0.245,0,0,0,"",{"$f":"IF(AJ65>0,IF(AF65=\"ESTIMEE\",AN65,DISTANCE5Q((AG65+AK65)/(AH65+AL65),distance)),AI65)","v":65},"ESTIMEE",65,null,{"$f":"IF(AH65=\"\",AG65,DISTANCE5Q(AG65/AH65,distance))","v":65},0,null,0,"",{"$f":"IFERROR(DISTANCE5Q(AM65,distance),\"\")","v":""}]
["MAS","LECUGY",{"$f":"IFERROR(IF(MATCH(Moyennes!B66,'nouveaux joueurs'!B:B,0) >1,\"nouveau joueur\",\"\"),\"\")","v":""},3.13,{"$f":"IFERROR(DISTANCELIBRE(D66,table),\"\")","v":103},"OFFICIELLE",1,3.13,0,0,0,"",1.35,{"$f":"IFERROR(DISTANCEBANDE(M66,distance),\"\")","v":50},"ESTIMEE",1,1.35,0,0,0,"",0.37,{"$f":"IFERROR(DISTANCE3BANDES(V66,distance),\"\")","v":21},"OFFICIELLE",1,0.37,0,0,0,"",{"$f":"IF(AJ66>0,IF(AF66=\"ESTIMEE\",AN66,DISTANCE5Q((AG66+AK66)/(AH66+AL66),distance)),AI66)","v":74},"ESTIMEE",74,null,{"$f":"IF(AH66=\"\",AG66,DISTANCE5Q(AG66/AH66,distance))","v":74},0,0,0,"",{"$f":"IFERROR(DISTANCE5Q(AM66,distance),\"\")","v":""}]
["COR","LEGRAND",{"$f":"IFERROR(IF(MATCH(Moyennes!B67,'nouveaux joueurs'!B:B,0) >1,\"nouveau joueur\",\"\"),\"\")","v":""},1.36,{"$f":"IFERROR(DISTANCELIBRE(D67,table),\"\")","v":60},"OFFICIELLE",1,1.36,0,0,0,"",0.65,{"$f":"IFERROR(DISTANCEBANDE(M67,distance),\"\")","v":36},"ESTIMEE",1,0.65,0,0,0,"",0.22,{"$f":"IFERROR(DISTANCE3BANDES(V67,distance),\"\")","v":15},"OFFICIELLE",1,0.22,0,0,0,"",{"$f":"IF(AJ67>0,IF(AF67=\"ESTIMEE\",AN67,DISTANCE5Q((AG67+AK67)/(AH67+AL67),distance)),AI67)","v":66},"ESTIMEE",66,null,{"$f":"IF(AH67=\"\",AG67,DISTANCE5Q(AG67/AH67,distance))","v":66},0,0,0,"",{"$f":"IFERROR(DISTANCE5Q(AM67,distance),\"\")","v":""}]
["MAS","LEVANIER",null,0.3,{"$f":"IFERROR(DISTANCELIBRE(D68,table),\"\")","v":31},"OFFICIELLE",1,0.3,null,null,null,null,{"$f":"IF(R68>0,IF(O68=\"ESTIMEE\",U68,(Q68*P68+R68*U68)/(P68+R68)),Q68)","v":0},{"$f":"IFERROR(DISTANCEBANDE(M68,distance),\"\")","v":23},"OFFICIELLE",1,0,null,null,null,null,{"$f":"IF(AA68>0,IF(X68=\"ESTIMEE\",AD68,(Z68*Y68+AA68*AD68)/(Y68+AA68)),Z68)","v":7.0000000000000007E-2},{"$f":"IFERROR(DISTANCE3BANDES(V68,distance),\"\")","v":10},"CDBE",1,7.0000000000000007E-2,0,0,0,{"$f":"IFERROR(AB68/AC68,\"\")","v":""},{"$f":"IF(AJ68>0,IF(AF68=\"ESTIMEE\",AN68,DISTANCE5Q((AG68+AK68)/(AH68+AL68),distance)),AI68)","v":60},"ESTIMEE",60,null,{"$f":"IF(AH68=\"\",AG68,DISTANCE5Q(AG68/AH68,distance))","v":60}]
["DRA","LEVOIVENEL",{"$f":"IFERROR(IF(MATCH(Moyennes!B69,'nouveaux joueurs'!B:B,0) >1,\"nouveau joueur\",\"\"),\"\")","v":""},1.55,{"$f":"IFERROR(DISTANCELIBRE(D69,table),\"\")","v":65},"OFFICIELLE",1,1.55,0,0,0,"",0,{"$f":"IFERROR(DISTANCEBANDE(M69,distance),\"\")","v":23},"OFFICIELLE",1,0,0,0,0,"",0.16900000000000001,{"$f":"IFERROR(DISTANCE3BANDES(V69,distance),\"\")","v":13},"CDBE",1,0.16900000000000001,0,0,0,"",{"$f":"IF(AJ69>0,IF(AF69=\"ESTIMEE\",AN69,DISTANCE5Q((AG69+AK69)/(AH69+AL69),distance)),AI69)","v":67},"ESTIMEE",67,null,{"$f":"IF(AH69=\"\",AG69,DISTANCE5Q(AG69/AH69,distance))","v":67},0,0,0,"",{"$f":"IFERROR(DISTANCE5Q(AM69,distance),\"\")","v":""}]
["ETR","LHOMME",{"$f":"IFERROR(IF(MATCH(Moyennes!B70,'nouveaux joueurs'!B:B,0) >1,\"nouveau joueur\",\"\"),\"\")","v":""},{"$f":"IF(I70>0,IF(F70=\"ESTIMEE\",L70,(H70*G70+I70*L70)/(G70+I70)),H70)","v":1.73},{"$f":"IFERROR(DISTANCELIBRE(D70,table),\"\")","v":70},"OFFICIELLE",1,1.73,{"$f":"IFERROR(GETPIVOTDATA(\"Nb parties\",Moyennes_libre,\"Joueur \",$B70),0)","v":0},{"$f":"IFERROR(GETPIVOTDATA(\"Total points\",Moyennes_libre,\"Joueur \",$B70),0)","v":0},{"$f":"IFERROR(GETPIVOTDATA(\"Total reprises\",Moyennes_libre,\"Joueur \",$B70),0)","v":0},"",{"$f":"IF(R70>0,IF(O70=\"ESTIMEE\",U70,(Q70*P70+R70*U70)/(P70+R70)),Q70)","v":0.96116279069767441},{"$f":"IFERROR(DISTANCEBANDE(M70,distance),\"\")","v":42},"OFFICIELLE",1,0.93,{"$f":"IFERROR(GETPIVOTDATA(\"Nb parties\",Moyennes_bande,\"Joueur \",$B70),0)","v":2},{"$f":"IFERROR(GETPIVOTDATA(\"Total points\",Moyennes_bande,\"Joueur \",$B70),0)","v":84},{"$f":"IFERROR(GETPIVOTDATA(\"Total reprises\",Moyennes_bande,\"Joueur \",$B70),0)","v":86},0.97674418604651159,{"$f":"IF(AA70>0,IF(X70=\"ESTIMEE\",AD70,(Z70*Y70+AA70*AD70)/(Y70+AA70)),Z70)","v":0.2},{"$f":"IFERROR(DISTANCE3BANDES(V70,distance),\"\")","v":14},"CDBE",1,0.2,{"$f":"IFERROR(GETPIVOTDATA(\"Nb parties\",Moyennes_3bandes,\"Joueur \",$B70),0)","v":0},{"$f":"IFERROR(GETPIVOTDATA(\"Total points\",Moyennes_3bandes,\"Joueur \",$B70),0)","v":0},{"$f":"IFERROR(GETPIVOTDATA(\"Total reprises\",Moyennes_3bandes,\"Joueur \",$B70),0)","v":0},"",{"$f":"IF(AJ70>0,IF(AF70=\"ESTIMEE\",AN70,DISTANCE5Q((AG70+AK70)/(AH70+AL70),distance)),AI70)","v":67},"ESTIMEE",68,null,{"$f":"IF(AH70=\"\",AG70,DISTANCE5Q(AG70/AH70,distance))","v":68},{"$f":"IFERROR(GETPIVOTDATA(\"Nb parties\",Moyennes_5quilles,\"Joueur \",$B70),0)","v":3},{"$f":"IFERROR(GETPIVOTDATA(\"Total points joueur\",Moyennes_5quilles,\"Joueur \",$B70),0)","v":325},{"$f":"IFERROR(GETPIVOTDATA(\"Total points adversaire\",Moyennes_5quilles,\"Joueur \",$B70),0)","v":427},0.76112412177985944,{"$f":"IFERROR(DISTANCE5Q(AM70,distance),\"\")","v":67}]
["MOR","LILLO",{"$f":"IFERROR(IF(MATCH(Moyennes!B71,'nouveaux joueurs'!B:B,0) >1,\"nouveau joueur\",\"\"),\"\")","v":""},2,{"$f":"IFERROR(DISTANCELIBRE(D71,table),\"\")","v":77},"CDBE",1,2,0,0,0,"",0.5,{"$f":"IFERROR(DISTANCEBANDE(M71,distance),\"\")","v":33},"CDBE",1,0.5,0,0,0,{"$f":"IFERROR(S71/T71,\"\")","v":""},0.25,{"$f":"IFERROR(DISTANCE3BANDES(V71,distance),\"\")","v":16},"CDBE",1,0.25,0,0,0,{"$f":"IFERROR(AB71/AC71,\"\")","v":""},{"$f":"IF(AJ71>0,IF(AF71=\"ESTIMEE\",AN71,DISTANCE5Q((AG71+AK71)/(AH71+AL71),distance)),AI71)","v":91},"ESTIMEE",69,null,{"$f":"IF(AH71=\"\",AG71,DISTANCE5Q(AG71/AH71,distance))","v":69},2,285,220,{"$f":"IFERROR(AK71/AL71,\"\")","v":1.2954545454545454},{"$f":"IFERROR(DISTANCE5Q(AM71,distance),\"\")","v":91}]
["MOR","LIOTARD",{"$f":"IFERROR(IF(MATCH(Moyennes!B72,'nouveaux joueurs'!B:B,0) >1,\"nouveau joueur\",\"\"),\"\")","v":""},1.6,{"$f":"IFERROR(DISTANCELIBRE(D72,table),\"\")","v":67},"OFFICIELLE",1,1.6,0,0,0,"",0.84,{"$f":"IFERROR(DISTANCEBANDE(M72,distance),\"\")","v":40},"OFFICIELLE",1,0.84,0,0,0,"",0.16500000000000001,{"$f":"IFERROR(DISTANCE3BANDES(V72,distance),\"\")","v":13},"CDBE",1,0.16500000000000001,0,0,0,"",{"$f":"IF(AJ72>0,IF(AF72=\"ESTIMEE\",AN72,DISTANCE5Q((AG72+AK72)/(AH72+AL72),distance)),AI72)","v":67},"ESTIMEE",67,null,{"$f":"IF(AH72=\"\",AG72,DISTANCE5Q(AG72/AH72,distance))","v":67},0,0,0,"",{"$f":"IFERROR(DISTANCE5Q(AM72,distance),\"\")","v":""}]
["COR","LLAMEDO",{"$f":"IFERROR(IF(MATCH(Moyennes!B73,'nouveaux joueurs'!B:B,0) >1,\"nouveau joueur\",\"\"),\"\")","v":""},3.57,{"$f":"IFERROR(DISTANCELIBRE(D73,table),\"\")","v":112},"CDBE",1,3.57,0,0,0,"",1.75,{"$f":"IFERROR(DISTANCEBANDE(M73,distance),\"\")","v":57},"CDBE",1,1.75,0,0,0,"",0.41799999999999998,{"$f":"IFERROR(DISTANCE3BANDES(V73,distance),\"\")","v":23},"CDBE",1,0.41799999999999998,0,0,0,"",{"$f":"IF(AJ73>0,IF(AF73=\"ESTIMEE\",AN73,DISTANCE5Q((AG73+AK73)/(AH73+AL73),distance)),AI73)","v":77},"ESTIMEE",77,null,{"$f":"IF(AH73=\"\",AG73,DISTANCE5Q(AG73/AH73,distance))","v":77},0,0,0,"",{"$f":"IFERROR(DISTANCE5Q(AM73,distance),\"\")","v":""}]
["ARP","LORENZI",{"$f":"IFERROR(IF(MATCH(Moyennes!B74,'nouveaux joueurs'!B:B,0) >1,\"nouveau joueur\",\"\"),\"\")","v":"nouveau joueur"},{"$f":"IF(I74>0,IF(F74=\"ESTIMEE\",L74,(H74*G74+I74*L74)/(G74+I74)),H74)","v":0.67249190938511327},{"$f":"IFERROR(DISTANCELIBRE(D74,table),\"\")","v":42},"OFFICIELLE",1,0.6,2,73,103,{"$f":"IFERROR(J74/K74,\"\")","v":0.70873786407766992},{"$f":"IF(R74>0,IF(O74=\"ESTIMEE\",U74,(Q74*P74+R74*U74)/(P74+R74)),Q74)","v":0.45},{"$f":"IFERROR(DISTANCEBANDE(M74,distance),\"\")","v":32},"OFFICIELLE",1,0.45,0,0,0,{"$f":"IFERROR(S74/T74,\"\")","v":""},{"$f":"IF(AA74>0,IF(X74=\"ESTIMEE\",AD74,(Z74*Y74+AA74*AD74)/(Y74+AA74)),Z74)","v":0.18},{"$f":"IFERROR(DISTANCE3BANDES(V74,distance),\"\")","v":13},"CDBE",1,0.18,0,0,0,{"$f":"IFERROR(AB74/AC74,\"\")","v":""},{"$f":"IF(AJ74>0,IF(AF74=\"ESTIMEE\",AN74,DISTANCE5Q((AG74+AK74)/(AH74+AL74),distance)),AI74)","v":63},"ESTIMEE",63,null,{"$f":"IF(AH74=\"\",AG74,DISTANCE5Q(AG74/AH74,distance))","v":63},0,0,0,{"$f":"IFERROR(AK74/AL74,\"\")","v":""},{"$f":"IFERROR(DISTANCE5Q(AM74,distance),\"\")","v":""}]
["ETR","LOUBIGNAC",{"$f":"IFERROR(IF(MATCH(Moyennes!B75,'nouveaux joueurs'!B:B,0) >1,\"nouveau joueur\",\"\"),\"\")","v":""},0.95000000000000007,{"$f":"IFERROR(DISTANCELIBRE(D75,table),\"\")","v":49},"OFFICIELLE",1,0.85,2,81,81,1,0.41,{"$f":"IFERROR(DISTANCEBANDE(M75,distance),\"\")","v":31},"OFFICIELLE",1,0.41,0,0,0,"",0.15,{"$f":"IFERROR(DISTANCE3BANDES(V75,distance),\"\")","v":12},"CDBE",1,0.15,0,0,0,"",{"$f":"IF(AJ75>0,IF(AF75=\"ESTIMEE\",AN75,DISTANCE5Q((AG75+AK75)/(AH75+AL75),distance)),AI75)","v":64},"ESTIMEE",64,null,{"$f":"IF(AH75=\"\",AG75,DISTANCE5Q(AG75/AH75,distance))","v":64},0,0,0,"",{"$f":"IFERROR(DISTANCE5Q(AM75,distance),\"\")","v":""}]
["MOR","MAILLARD",{"$f":"IFERROR(IF(MATCH(Moyennes!B76,'nouveaux joueurs'!B:B,0) >1,\"nouveau joueur\",\"\"),\"\")","v":""},1.365,{"$f":"IFERROR(DISTANCELIBRE(D76,table),\"\")","v":60},"OFFICIELLE",1,0.85,1,47,25,1.88,1,{"$f":"IFERROR(DISTANCEBANDE(M76,distance),\"\")","v":43},"ESTIMEE",1,0.4,2,70,70,1,0.25,{"$f":"IFERROR(DISTANCE3BANDES(V76,distance),\"\")","v":16},"CDBE",1,0.25,0,0,0,"",{"$f":"IF(AJ76>0,IF(AF76=\"ESTIMEE\",AN76,DISTANCE5Q((AG76+AK76)/(AH76+AL76),distance)),AI76)","v":64},"ESTIMEE",64,null,{"$f":"IF(AH76=\"\",AG76,DISTANCE5Q(AG76/AH76,distance))","v":64},0,0,0,"",{"$f":"IFERROR(DISTANCE5Q(AM76,distance),\"\")","v":""}]
["DRA","MARTINEZ",{"$f":"IFERROR(IF(MATCH(Moyennes!B77,'nouveaux joueurs'!B:B,0) >1,\"nouveau joueur\",\"\"),\"\")","v":""},1,{"$f":"IFERROR(DISTANCELIBRE(D77,table),\"\")","v":51},"OFFICIELLE",1,1,0,0,0,"",0.5,{"$f":"IFERROR(DISTANCEBANDE(M77,distance),\"\")","v":33},"ESTIMEE",1,0.5,0,0,0,"",0.2,{"$f":"IFERROR(DISTANCE3BANDES(V77,distance),\"\")","v":14},"CDBE",1,0.2,0,0,0,"",{"$f":"IF(AJ77>0,IF(AF77=\"ESTIMEE\",AN77,DISTANCE5Q((AG77+AK77)/(AH77+AL77),distance)),AI77)","v":65},"ESTIMEE",65,null,{"$f":"IF(AH77=\"\",AG77,DISTANCE5Q(AG77/AH77,distance))","v":65},0,0,0,"",{"$f":"IFERROR(DISTANCE5Q(AM77,distance),\"\")","v":""}]
["DRA","MERCIER",{"$f":"IFERROR(IF(MATCH(Moyennes!B78,'nouveaux joueurs'!B:B,0) >1,\"nouveau joueur\",\"\"),\"\")","v":""},0.9,{"$f":"IFERROR(DISTANCELIBRE(D78,table),\"\")","v":48},"CDBE",1,0.9,0,0,0,"",0.5,{"$f":"IFERROR(DISTANCEBANDE(M78,distance),\"\")","v":33},"CDBE",1,0.5,0,0,0,"",0.13,{"$f":"IFERROR(DISTANCE3BANDES(V78,distance),\"\")","v":11},"CDBE",1,0.13,0,0,0,"",{"$f":"IF(AJ78>0,IF(AF78=\"ESTIMEE\",AN78,DISTANCE5Q((AG78+AK78)/(AH78+AL78),distance)),AI78)","v":60},"ESTIMEE",60,null,{"$f":"IF(AH78=\"\",AG78,DISTANCE5Q(AG78/AH78,distance))","v":60},0,0,0,"",{"$f":"IFERROR(DISTANCE5Q(AM78,distance),\"\")","v":""}]
["DRA","MESNY",{"$f":"IFERROR(IF(MATCH(Moyennes!B79,'nouveaux joueurs'!B:B,0) >1,\"nouveau joueur\",\"\"),\"\")","v":""},0.64,{"$f":"IFERROR(DISTANCELIBRE(D79,table),\"\")","v":41},"OFFICIELLE",1,0.64,0,0,0,"",0.3,{"$f":"IFERROR(DISTANCEBANDE(M79,distance),\"\")","v":29},"ESTIMEE",1,0.3,0,0,0,"",0.20100000000000001,{"$f":"IFERROR(DISTANCE3BANDES(V79,distance),\"\")","v":14},"CDBE",1,0.20100000000000001,0,0,0,"",{"$f":"IF(AJ79>0,IF(AF79=\"ESTIMEE\",AN79,DISTANCE5Q((AG79+AK79)/(AH79+AL79),distance)),AI79)","v":68},"ESTIMEE",62,null,{"$f":"IF(AH79=\"\",AG79,DISTANCE5Q(AG79/AH79,distance))","v":62},1,98,125,0.78400000000000003,{"$f":"IFERROR(DISTANCE5Q(AM79,distance),\"\")","v":68}]
["MAS","MICHEL Louis",{"$f":"IFERROR(IF(MATCH(Moyennes!B80,'nouveaux joueurs'!B:B,0) >1,\"nouveau joueur\",\"\"),\"\")","v":""},3,{"$f":"IFERROR(DISTANCELIBRE(D80,table),\"\")","v":100},"CDBE",1,3,0,0,0,"",1.6,{"$f":"IFERROR(DISTANCEBANDE(M80,distance),\"\")","v":54},"CDBE",1,1.6,0,0,0,"",0.47199999999999998,{"$f":"IFERROR(DISTANCE3BANDES(V80,distance),\"\")","v":26},"CDBE",1,0.47199999999999998,0,0,0,"",{"$f":"IF(AJ80>0,IF(AF80=\"ESTIMEE\",AN80,DISTANCE5Q((AG80+AK80)/(AH80+AL80),distance)),AI80)","v":87},"ESTIMEE",87,null,{"$f":"IF(AH80=\"\",AG80,DISTANCE5Q(AG80/AH80,distance))","v":87},0,0,0,"",{"$f":"IFERROR(DISTANCE5Q(AM80,distance),\"\")","v":""}]
["VIG","MICHELET",{"$f":"IFERROR(IF(MATCH(Moyennes!B81,'nouveaux joueurs'!B:B,0) >1,\"nouveau joueur\",\"\"),\"\")","v":""},1.0501677852348994,{"$f":"IFERROR(DISTANCELIBRE(D81,table),\"\")","v":52},"CDBE",1,1.1000000000000001,3,154,149,1.0335570469798658,0.60584905660377364,{"$f":"IFERROR(DISTANCEBANDE(M81,distance),\"\")","v":35},"OFFICIELLE",1,0.61,2,64,106,0.60377358490566035,0.2,{"$f":"IFERROR(DISTANCE3BANDES(V81,distance),\"\")","v":14},"CDBE",1,0.2,0,0,0,"",{"$f":"IF(AJ81>0,IF(AF81=\"ESTIMEE\",AN81,DISTANCE5Q((AG81+AK81)/(AH81+AL81),distance)),AI81)","v":65},"ESTIMEE",65,null,{"$f":"IF(AH81=\"\",AG81,DISTANCE5Q(AG81/AH81,distance))","v":65},0,0,0,"",{"$f":"IFERROR(DISTANCE5Q(AM81,distance),\"\")","v":""}]
["DRA","MIRLAUD",{"$f":"IFERROR(IF(MATCH(Moyennes!B82,'nouveaux joueurs'!B:B,0) >1,\"nouveau joueur\",\"\"),\"\")","v":""},1.7643434343434343,{"$f":"IFERROR(DISTANCELIBRE(D82,table),\"\")","v":71},"OFFICIELLE",1,1.99,2,109,66,1.6515151515151516,1.1200000000000001,{"$f":"IFERROR(DISTANCEBANDE(M82,distance),\"\")","v":45},"CDBE",1,1.1200000000000001,0,0,0,"",0.22685154061624649,{"$f":"IFERROR(DISTANCE3BANDES(V82,distance),\"\")","v":15},"OFFICIELLE",1,0.29399999999999998,2,23,119,0.19327731092436976,{"$f":"IF(AJ82>0,IF(AF82=\"ESTIMEE\",AN82,DISTANCE5Q((AG82+AK82)/(AH82+AL82),distance)),AI82)","v":69},"ESTIMEE",69,null,{"$f":"IF(AH82=\"\",AG82,DISTANCE5Q(AG82/AH82,distance))","v":69},0,0,0,"",{"$f":"IFERROR(DISTANCE5Q(AM82,distance),\"\")","v":""}]
["MOR","MIRMAN",{"$f":"IFERROR(IF(MATCH(Moyennes!B83,'nouveaux joueurs'!B:B,0) >1,\"nouveau joueur\",\"\"),\"\")","v":""},2.9683870967741934,{"$f":"IFERROR(DISTANCELIBRE(D83,table),\"\")","v":99},"OFFICIELLE",1,2.84,1,96,31,{"$f":"IFERROR(J83/K83,\"\")","v":3.096774193548387},1.2389473684210528,{"$f":"IFERROR(DISTANCEBANDE(M83,distance),\"\")","v":48},"OFFICIELLE",1,1.32,1,44,38,1.1578947368421053,0.32800000000000001,{"$f":"IFERROR(DISTANCE3BANDES(V83,distance),\"\")","v":19},"OFFICIELLE",1,0.32800000000000001,0,0,0,"",{"$f":"IF(AJ83>0,IF(AF83=\"ESTIMEE\",AN83,DISTANCE5Q((AG83+AK83)/(AH83+AL83),distance)),AI83)","v":84},"ESTIMEE",73,null,{"$f":"IF(AH83=\"\",AG83,DISTANCE5Q(AG83/AH83,distance))","v":73},1,146,129,1.1317829457364341,{"$f":"IFERROR(DISTANCE5Q(AM83,distance),\"\")","v":84}]
["VIG","MOINDREAU",{"$f":"IFERROR(IF(MATCH(Moyennes!B84,'nouveaux joueurs'!B:B,0) >1,\"nouveau joueur\",\"\"),\"\")","v":""},{"$f":"IF(I84>0,IF(F84=\"ESTIMEE\",L84,(H84*G84+I84*L84)/(G84+I84)),H84)","v":1.4480172413793102},{"$f":"IFERROR(DISTANCELIBRE(D84,table),\"\")","v":63},"OFFICIELLE",1,1.68,3,159,116,{"$f":"IFERROR(J84/K84,\"\")","v":1.3706896551724137},{"$f":"IF(R84>0,IF(O84=\"ESTIMEE\",U84,(Q84*P84+R84*U84)/(P84+R84)),Q84)","v":0.65084337349397592},{"$f":"IFERROR(DISTANCEBANDE(M84,distance),\"\")","v":36},"OFFICIELLE",1,0.7,4,106,166,{"$f":"IFERROR(S84/T84,\"\")","v":0.63855421686746983},{"$f":"IF(AA84>0,IF(X84=\"ESTIMEE\",AD84,(Z84*Y84+AA84*AD84)/(Y84+AA84)),Z84)","v":0.2},{"$f":"IFERROR(DISTANCE3BANDES(V84,distance),\"\")","v":14},"CDBE",1,0.2,0,0,0,{"$f":"IFERROR(AB84/AC84,\"\")","v":""},{"$f":"IF(AJ84>0,IF(AF84=\"ESTIMEE\",AN84,DISTANCE5Q((AG84+AK84)/(AH84+AL84),distance)),AI84)","v":68},"ESTIMEE",68,null,{"$f":"IF(AH84=\"\",AG84,DISTANCE5Q(AG84/AH84,distance))","v":68},0,0,0,{"$f":"IFERROR(AK84/AL84,\"\")","v":""},{"$f":"IFERROR(DISTANCE5Q(AM84,distance),\"\")","v":""}]
["MAS","MOREAU",{"$f":"IFERROR(IF(MATCH(Moyennes!B85,'nouveaux joueurs'!B:B,0) >1,\"nouveau joueur\",\"\"),\"\")","v":""},1.23,{"$f":"IFERROR(DISTANCELIBRE(D85,table),\"\")","v":57},"OFFICIELLE",1,1.23,0,0,0,"",0.49,{"$f":"IFERROR(DISTANCEBANDE(M85,distance),\"\")","v":33},"OFFICIELLE",1,0.49,0,0,0,"",0.2,{"$f":"IFERROR(DISTANCE3BANDES(V85,distance),\"\")","v":14},"CDBE",1,0.2,0,0,0,"",{"$f":"IF(AJ85>0,IF(AF85=\"ESTIMEE\",AN85,DISTANCE5Q((AG85+AK85)/(AH85+AL85),distance)),AI85)","v":65},"ESTIMEE",65,null,{"$f":"IF(AH85=\"\",AG85,DISTANCE5Q(AG85/AH85,distance))","v":65},0,0,0,"",{"$f":"IFERROR(DISTANCE5Q(AM85,distance),\"\")","v":""}]
["MOR","MOREL",{"$f":"IFERROR(IF(MATCH(Moyennes!B86,'nouveaux joueurs'!B:B,0) >1,\"nouveau joueur\",\"\"),\"\")","v":""},2.6,{"$f":"IFERROR(DISTANCELIBRE(D86,table),\"\")","v":91},"OFFICIELLE",1,2.6,0,0,0,"",1.18,{"$f":"IFERROR(DISTANCEBANDE(M86,distance),\"\")","v":47},"OFFICIELLE",1,1.18,0,0,0,"",0.64200000000000002,{"$f":"IFERROR(DISTANCE3BANDES(V86,distance),\"\")","v":35},"OFFICIELLE",1,0.64200000000000002,0,0,0,"",{"$f":"IF(AJ86>0,IF(AF86=\"ESTIMEE\",AN86,DISTANCE5Q((AG86+AK86)/(AH86+AL86),distance)),AI86)","v":72},"ESTIMEE",72,null,{"$f":"IF(AH86=\"\",AG86,DISTANCE5Q(AG86/AH86,distance))","v":72},0,0,0,"",{"$f":"IFERROR(DISTANCE5Q(AM86,distance),\"\")","v":""}]
["DRA","MOULAY",{"$f":"IFERROR(IF(MATCH(Moyennes!B87,'nouveaux joueurs'!B:B,0) >1,\"nouveau joueur\",\"\"),\"\")","v":""},2.5383333333333336,{"$f":"IFERROR(DISTANCELIBRE(D87,table),\"\")","v":90},"OFFICIELLE",1,2.89,2,189,80,2.3624999999999998,1.5,{"$f":"IFERROR(DISTANCEBANDE(M87,distance),\"\")","v":53},"CDBE",1,1.5,0,0,0,"",0.48736363636363633,{"$f":"IFERROR(DISTANCE3BANDES(V87,distance),\"\")","v":26},"OFFICIELLE",1,0.45200000000000001,1,23,44,0.52272727272727271,{"$f":"IF(AJ87>0,IF(AF87=\"ESTIMEE\",AN87,DISTANCE5Q((AG87+AK87)/(AH87+AL87),distance)),AI87)","v":73},"ESTIMEE",73,null,{"$f":"IF(AH87=\"\",AG87,DISTANCE5Q(AG87/AH87,distance))","v":73},0,0,0,"",{"$f":"IFERROR(DISTANCE5Q(AM87,distance),\"\")","v":""}]
["ARP","NGUYEN",{"$f":"IFERROR(IF(MATCH(Moyennes!B88,'nouveaux joueurs'!B:B,0) >1,\"nouveau joueur\",\"\"),\"\")","v":"nouveau joueur"},{"$f":"IF(I88>0,IF(F88=\"ESTIMEE\",L88,(H88*G88+I88*L88)/(G88+I88)),H88)","v":2.91},{"$f":"IFERROR(DISTANCELIBRE(D88,table),\"\")","v":98},"OFFICIELLE",1,2.91,0,0,0,{"$f":"IFERROR(J88/K88,\"\")","v":""},{"$f":"IF(R88>0,IF(O88=\"ESTIMEE\",U88,(Q88*P88+R88*U88)/(P88+R88)),Q88)","v":1.31},{"$f":"IFERROR(DISTANCEBANDE(M88,distance),\"\")","v":49},"CDBE",1,1.31,0,0,0,{"$f":"IFERROR(S88/T88,\"\")","v":""},{"$f":"IF(AA88>0,IF(X88=\"ESTIMEE\",AD88,(Z88*Y88+AA88*AD88)/(Y88+AA88)),Z88)","v":0.3},{"$f":"IFERROR(DISTANCE3BANDES(V88,distance),\"\")","v":18},"CDBE",1,0.3,0,0,0,{"$f":"IFERROR(AB88/AC88,\"\")","v":""},{"$f":"IF(AJ88>0,IF(AF88=\"ESTIMEE\",AN88,DISTANCE5Q((AG88+AK88)/(AH88+AL88),distance)),AI88)","v":73},"ESTIMEE",73,null,{"$f":"IF(AH88=\"\",AG88,DISTANCE5Q(AG88/AH88,distance))","v":73},0,0,0,{"$f":"IFERROR(AK88/AL88,\"\")","v":""},{"$f":"IFERROR(DISTANCE5Q(AM88,distance),\"\")","v":""}]
["COR","NOE A.M.",{"$f":"IFERROR(IF(MATCH(Moyennes!B89,'nouveaux joueurs'!B:B,0) >1,\"nouveau joueur\",\"\"),\"\")","v":""},1.18,{"$f":"IFERROR(DISTANCELIBRE(D89,table),\"\")","v":56},"OFFICIELLE",1,1.18,0,0,0,"",0.66,{"$f":"IFERROR(DISTANCEBANDE(M89,distance),\"\")","v":36},"CDBE",1,0.66,0,0,0,"",0.16,{"$f":"IFERROR(DISTANCE3BANDES(V89,distance),\"\")","v":12},"CDBE",1,0.16,0,0,0,"",{"$f":"IF(AJ89>0,IF(AF89=\"ESTIMEE\",AN89,DISTANCE5Q((AG89+AK89)/(AH89+AL89),distance)),AI89)","v":65},"ESTIMEE",65,null,{"$f":"IF(AH89=\"\",AG89,DISTANCE5Q(AG89/AH89,distance))","v":65},0,0,0,"",{"$f":"IFERROR(DISTANCE5Q(AM89,distance),\"\")","v":""}]
["COR","NOE L",{"$f":"IFERROR(IF(MATCH(Moyennes!B90,'nouveaux joueurs'!B:B,0) >1,\"nouveau joueur\",\"\"),\"\")","v":""},2,{"$f":"IFERROR(DISTANCELIBRE(D90,table),\"\")","v":77},"CDBE",1,2,0,0,0,"",1.03,{"$f":"IFERROR(DISTANCEBANDE(M90,distance),\"\")","v":44},"CDBE",1,1.03,0,0,0,"",0.2,{"$f":"IFERROR(DISTANCE3BANDES(V90,distance),\"\")","v":14},"CDBE",1,0.2,0,0,0,"",{"$f":"IF(AJ90>0,IF(AF90=\"ESTIMEE\",AN90,DISTANCE5Q((AG90+AK90)/(AH90+AL90),distance)),AI90)","v":63},"ESTIMEE",63,null,{"$f":"IF(AH90=\"\",AG90,DISTANCE5Q(AG90/AH90,distance))","v":63},0,0,0,"",{"$f":"IFERROR(DISTANCE5Q(AM90,distance),\"\")","v":""}]
["ARP","NURISSO",{"$f":"IFERROR(IF(MATCH(Moyennes!B91,'nouveaux joueurs'!B:B,0) >1,\"nouveau joueur\",\"\"),\"\")","v":""},2.6,{"$f":"IFERROR(DISTANCELIBRE(D91,table),\"\")","v":91},"CDBE",1,2.6,0,0,0,"",1.45,{"$f":"IFERROR(DISTANCEBANDE(M91,distance),\"\")","v":52},"CDBE",1,1.45,0,0,0,"",0.39,{"$f":"IFERROR(DISTANCE3BANDES(V91,distance),\"\")","v":22},"CDBE",1,0.39,0,0,0,"",{"$f":"IF(AJ91>0,IF(AF91=\"ESTIMEE\",AN91,DISTANCE5Q((AG91+AK91)/(AH91+AL91),distance)),AI91)","v":68},"ESTIMEE",68,null,{"$f":"IF(AH91=\"\",AG91,DISTANCE5Q(AG91/AH91,distance))","v":68},0,0,0,"",{"$f":"IFERROR(DISTANCE5Q(AM91,distance),\"\")","v":""}]
["COR","OUVRARD",{"$f":"IFERROR(IF(MATCH(Moyennes!B92,'nouveaux joueurs'!B:B,0) >1,\"nouveau joueur\",\"\"),\"\")","v":""},1.74,{"$f":"IFERROR(DISTANCELIBRE(D92,table),\"\")","v":70},"OFFICIELLE",1,1.74,0,0,0,"",0.81,{"$f":"IFERROR(DISTANCEBANDE(M92,distance),\"\")","v":39},"OFFICIELLE",1,0.81,0,0,0,"",0.42,{"$f":"IFERROR(DISTANCE3BANDES(V92,distance),\"\")","v":23},"OFFICIELLE",1,0.42,0,0,0,"",{"$f":"IF(AJ92>0,IF(AF92=\"ESTIMEE\",AN92,DISTANCE5Q((AG92+AK92)/(AH92+AL92),distance)),AI92)","v":68},"ESTIMEE",68,null,{"$f":"IF(AH92=\"\",AG92,DISTANCE5Q(AG92/AH92,distance))","v":68},0,0,0,"",{"$f":"IFERROR(DISTANCE5Q(AM92,distance),\"\")","v":""}]
["MOR","PAIS",{"$f":"IFERROR(IF(MATCH(Moyennes!B93,'nouveaux joueurs'!B:B,0) >1,\"nouveau joueur\",\"\"),\"\")","v":""},3,{"$f":"IFERROR(DISTANCELIBRE(D93,table),\"\")","v":100},"CDBE",1,3,0,0,0,"",1.2,{"$f":"IFERROR(DISTANCEBANDE(M93,distance),\"\")","v":47},"OFFICIELLE",1,1.2,0,0,0,"",0.41350265957446808,{"$f":"IFERROR(DISTANCE3BANDES(V93,distance),\"\")","v":23},"OFFICIELLE",1,0.441,7,154,376,0.40957446808510639,{"$f":"IF(AJ93>0,IF(AF93=\"ESTIMEE\",AN93,DISTANCE5Q((AG93+AK93)/(AH93+AL93),distance)),AI93)","v":74},"ESTIMEE",74,null,{"$f":"IF(AH93=\"\",AG93,DISTANCE5Q(AG93/AH93,distance))","v":74},0,0,0,"",{"$f":"IFERROR(DISTANCE5Q(AM93,distance),\"\")","v":""}]
["ETR","PAPELARD",{"$f":"IFERROR(IF(MATCH(Moyennes!B94,'nouveaux joueurs'!B:B,0) >1,\"nouveau joueur\",\"\"),\"\")","v":""},1.5,{"$f":"IFERROR(DISTANCELIBRE(D94,table),\"\")","v":64},"ESTIMEE",1,1.5,0,0,0,"",0.65,{"$f":"IFERROR(DISTANCEBANDE(M94,distance),\"\")","v":36},"OFFICIELLE",1,0.65,0,0,0,"",0.15,{"$f":"IFERROR(DISTANCE3BANDES(V94,distance),\"\")","v":12},"CDBE",1,0.15,0,0,0,"",{"$f":"IF(AJ94>0,IF(AF94=\"ESTIMEE\",AN94,DISTANCE5Q((AG94+AK94)/(AH94+AL94),distance)),AI94)","v":60},"ESTIMEE",58,null,60,0,0,0,"",{"$f":"IFERROR(DISTANCE5Q(AM94,distance),\"\")","v":""}]
["ARP","PARIS Philippe",{"$f":"IFERROR(IF(MATCH(Moyennes!B95,'nouveaux joueurs'!B:B,0) >1,\"nouveau joueur\",\"\"),\"\")","v":""},0.96,{"$f":"IFERROR(DISTANCELIBRE(D95,table),\"\")","v":50},"OFFICIELLE",1,0.96,0,0,0,"",0.56999999999999995,{"$f":"IFERROR(DISTANCEBANDE(M95,distance),\"\")","v":35},"CDBE",1,0.56999999999999995,0,0,0,"",0.13,{"$f":"IFERROR(DISTANCE3BANDES(V95,distance),\"\")","v":11},"CDBE",1,0.13,0,0,0,"",{"$f":"IF(AJ95>0,IF(AF95=\"ESTIMEE\",AN95,DISTANCE5Q((AG95+AK95)/(AH95+AL95),distance)),AI95)","v":65},"ESTIMEE",65,null,{"$f":"IF(AH95=\"\",AG95,DISTANCE5Q(AG95/AH95,distance))","v":65},0,0,0,"",{"$f":"IFERROR(DISTANCE5Q(AM95,distance),\"\")","v":""}]
["ETR","PORCU",{"$f":"IFERROR(IF(MATCH(Moyennes!B96,'nouveaux joueurs'!B:B,0) >1,\"nouveau joueur\",\"\"),\"\")","v":""},1.23,{"$f":"IFERROR(DISTANCELIBRE(D96,table),\"\")","v":57},"OFFICIELLE",1,1.23,0,0,0,"",0.75,{"$f":"IFERROR(DISTANCEBANDE(M96,distance),\"\")","v":38},"OFFICIELLE",1,0.75,0,0,0,"",0.15,{"$f":"IFERROR(DISTANCE3BANDES(V96,distance),\"\")","v":12},"CDBE",1,0.15,0,0,0,"",{"$f":"IF(AJ96>0,IF(AF96=\"ESTIMEE\",AN96,DISTANCE5Q((AG96+AK96)/(AH96+AL96),distance)),AI96)","v":70},"ESTIMEE",65,null,{"$f":"IF(AH96=\"\",AG96,DISTANCE5Q(AG96/AH96,distance))","v":65},2,219,268,0.81716417910447758,{"$f":"IFERROR(DISTANCE5Q(AM96,distance),\"\")","v":70}]
["ARP","PINTO",{"$f":"IFERROR(IF(MATCH(Moyennes!B97,'nouveaux joueurs'!B:B,0) >1,\"nouveau joueur\",\"\"),\"\")","v":""},1,{"$f":"IFERROR(DISTANCELIBRE(D97,table),\"\")","v":51},"CDBE",1,1,0,0,0,"",0.86,{"$f":"IFERROR(DISTANCEBANDE(M97,distance),\"\")","v":40},"OFFICIELLE",1,0.86,0,0,0,"",0.22974316939890707,{"$f":"IFERROR(DISTANCE3BANDES(V97,distance),\"\")","v":15},"OFFICIELLE",1,0.26300000000000001,2,26,122,0.21311475409836064,{"$f":"IF(AJ97>0,IF(AF97=\"ESTIMEE\",AN97,DISTANCE5Q((AG97+AK97)/(AH97+AL97),distance)),AI97)","v":65},"ESTIMEE",65,null,{"$f":"IF(AH97=\"\",AG97,DISTANCE5Q(AG97/AH97,distance))","v":65},0,0,0,"",{"$f":"IFERROR(DISTANCE5Q(AM97,distance),\"\")","v":""}]
["COR","POUGES",{"$f":"IFERROR(IF(MATCH(Moyennes!B98,'nouveaux joueurs'!B:B,0) >1,\"nouveau joueur\",\"\"),\"\")","v":""},1.76,{"$f":"IFERROR(DISTANCELIBRE(D98,table),\"\")","v":71},"OFFICIELLE",1,1.76,0,0,0,"",1.06,{"$f":"IFERROR(DISTANCEBANDE(M98,distance),\"\")","v":44},"OFFICIELLE",1,1.06,0,0,0,"",0.28599999999999998,{"$f":"IFERROR(DISTANCE3BANDES(V98,distance),\"\")","v":17},"OFFICIELLE",1,0.28599999999999998,0,0,0,"",{"$f":"IF(AJ98>0,IF(AF98=\"ESTIMEE\",AN98,DISTANCE5Q((AG98+AK98)/(AH98+AL98),distance)),AI98)","v":68},"ESTIMEE",68,null,{"$f":"IF(AH98=\"\",AG98,DISTANCE5Q(AG98/AH98,distance))","v":68},0,0,0,"",{"$f":"IFERROR(DISTANCE5Q(AM98,distance),\"\")","v":""}]
["MOR","PREVOT",{"$f":"IFERROR(IF(MATCH(Moyennes!B99,'nouveaux joueurs'!B:B,0) >1,\"nouveau joueur\",\"\"),\"\")","v":""},0.99935114503816791,{"$f":"IFERROR(DISTANCELIBRE(D99,table),\"\")","v":51},"OFFICIELLE",1,0.86,3,137,131,1.0458015267175573,0.75,{"$f":"IFERROR(DISTANCEBANDE(M99,distance),\"\")","v":38},"CDBE",1,0.75,0,0,0,"",0.2,{"$f":"IFERROR(DISTANCE3BANDES(V99,distance),\"\")","v":14},"CDBE",1,0.2,0,0,0,"",{"$f":"IF(AJ99>0,IF(AF99=\"ESTIMEE\",AN99,DISTANCE5Q((AG99+AK99)/(AH99+AL99),distance)),AI99)","v":64},"ESTIMEE",64,null,{"$f":"IF(AH99=\"\",AG99,DISTANCE5Q(AG99/AH99,distance))","v":64},0,0,0,"",{"$f":"IFERROR(DISTANCE5Q(AM99,distance),\"\")","v":""}]
["MOR","PRIEUR",{"$f":"IFERROR(IF(MATCH(Moyennes!B100,'nouveaux joueurs'!B:B,0) >1,\"nouveau joueur\",\"\"),\"\")","v":""},0.96,{"$f":"IFERROR(DISTANCELIBRE(D100,table),\"\")","v":50},"CDBE",1,0.96,0,0,0,"",0.62770491803278694,{"$f":"IFERROR(DISTANCEBANDE(M100,distance),\"\")","v":36},"OFFICIELLE",1,0.78,1,29,61,0.47540983606557374,0.25,{"$f":"IFERROR(DISTANCE3BANDES(V100,distance),\"\")","v":16},"CDBE",1,0.25,0,0,0,"",{"$f":"IF(AJ100>0,IF(AF100=\"ESTIMEE\",AN100,DISTANCE5Q((AG100+AK100)/(AH100+AL100),distance)),AI100)","v":65},"ESTIMEE",65,null,{"$f":"IF(AH100=\"\",AG100,DISTANCE5Q(AG100/AH100,distance))","v":65},0,0,0,"",{"$f":"IFERROR(DISTANCE5Q(AM100,distance),\"\")","v":""}]
["DRA","RIBEYRE",{"$f":"IFERROR(IF(MATCH(Moyennes!B101,'nouveaux joueurs'!B:B,0) >1,\"nouveau joueur\",\"\"),\"\")","v":""},0.5,{"$f":"IFERROR(DISTANCELIBRE(D101,table),\"\")","v":37},"CDBE",1,0.5,0,0,0,"",0.3,{"$f":"IFERROR(DISTANCEBANDE(M101,distance),\"\")","v":29},"CDBE",1,0.3,0,0,0,"",0.13,{"$f":"IFERROR(DISTANCE3BANDES(V101,distance),\"\")","v":11},"CDBE",1,0.13,0,0,0,"",{"$f":"IF(AJ101>0,IF(AF101=\"ESTIMEE\",AN101,DISTANCE5Q((AG101+AK101)/(AH101+AL101),distance)),AI101)","v":60},"ESTIMEE",60,null,60,0,0,0,"",{"$f":"IFERROR(DISTANCE5Q(AM101,distance),\"\")","v":""}]
["VIG","ROUX",{"$f":"IFERROR(IF(MATCH(Moyennes!B102,'nouveaux joueurs'!B:B,0) >1,\"nouveau joueur\",\"\"),\"\")","v":""},0.4,{"$f":"IFERROR(DISTANCELIBRE(D102,table),\"\")","v":34},"CDBE",1,0.4,0,0,0,"",0.49,{"$f":"IFERROR(DISTANCEBANDE(M102,distance),\"\")","v":33},"OFFICIELLE",1,0.49,0,0,0,"",0.18079415954415953,{"$f":"IFERROR(DISTANCE3BANDES(V102,distance),\"\")","v":13},"OFFICIELLE",1,0.17,7,64,351,0.18233618233618235,{"$f":"IF(AJ102>0,IF(AF102=\"ESTIMEE\",AN102,DISTANCE5Q((AG102+AK102)/(AH102+AL102),distance)),AI102)","v":70},"ESTIMEE",70,null,{"$f":"IF(AH102=\"\",AG102,DISTANCE5Q(AG102/AH102,distance))","v":70},0,0,0,"",{"$f":"IFERROR(DISTANCE5Q(AM102,distance),\"\")","v":""}]
["VIG","SAHNOUNE",{"$f":"IFERROR(IF(MATCH(Moyennes!B103,'nouveaux joueurs'!B:B,0) >1,\"nouveau joueur\",\"\"),\"\")","v":""},0.7,{"$f":"IFERROR(DISTANCELIBRE(D103,table),\"\")","v":42},"ESTIMEE",1,0.7,0,0,0,"",0.65,{"$f":"IFERROR(DISTANCEBANDE(M103,distance),\"\")","v":36},"ESTIMEE",1,0.65,{"$f":"IFERROR(GETPIVOTDATA(\"Nb parties\",Moyennes_bande,\"Joueur \",$B103),0)","v":0},{"$f":"IFERROR(GETPIVOTDATA(\"Total points\",Moyennes_bande,\"Joueur \",$B103),0)","v":0},{"$f":"IFERROR(GETPIVOTDATA(\"Total reprises\",Moyennes_bande,\"Joueur \",$B103),0)","v":0},"",0.15,{"$f":"IFERROR(DISTANCE3BANDES(V103,distance),\"\")","v":12},"ESTIMEE",1,0.15,{"$f":"IFERROR(GETPIVOTDATA(\"Nb parties\",Moyennes_3bandes,\"Joueur \",$B103),0)","v":0},{"$f":"IFERROR(GETPIVOTDATA(\"Total points\",Moyennes_3bandes,\"Joueur \",$B103),0)","v":0},{"$f":"IFERROR(GETPIVOTDATA(\"Total reprises\",Moyennes_3bandes,\"Joueur \",$B103),0)","v":0},"",{"$f":"IF(AJ103>0,IF(AF103=\"ESTIMEE\",AN103,DISTANCE5Q((AG103+AK103)/(AH103+AL103),distance)),AI103)","v":63},"ESTIMEE",63,null,{"$f":"IF(AH103=\"\",AG103,DISTANCE5Q(AG103/AH103,distance))","v":63},{"$f":"IFERROR(GETPIVOTDATA(\"Nb parties\",Moyennes_5quilles,\"Joueur \",$B103),0)","v":0},{"$f":"IFERROR(GETPIVOTDATA(\"Total points joueur\",Moyennes_5quilles,\"Joueur \",$B103),0)","v":0},{"$f":"IFERROR(GETPIVOTDATA(\"Total points adversaire\",Moyennes_5quilles,\"Joueur \",$B103),0)","v":0},"",{"$f":"IFERROR(DISTANCE5Q(AM103,distance),\"\")","v":""}]
["ETR","SAULE",{"$f":"IFERROR(IF(MATCH(Moyennes!B104,'nouveaux joueurs'!B:B,0) >1,\"nouveau joueur\",\"\"),\"\")","v":"nouveau joueur"},{"$f":"IF(I104>0,IF(F104=\"ESTIMEE\",L104,(H104*G104+I104*L104)/(G104+I104)),H104)","v":0.6},{"$f":"IFERROR(DISTANCELIBRE(D104,table),\"\")","v":40},"ESTIMEE",1,0.6,0,0,0,{"$f":"IFERROR(J104/K104,\"\")","v":""},{"$f":"IF(R104>0,IF(O104=\"ESTIMEE\",U104,(Q104*P104+R104*U104)/(P104+R104)),Q104)","v":0.3},{"$f":"IFERROR(DISTANCEBANDE(M104,distance),\"\")","v":29},"ESTIMEE",1,0.3,0,0,0,{"$f":"IFERROR(S104/T104,\"\")","v":""},{"$f":"IF(AA104>0,IF(X104=\"ESTIMEE\",AD104,(Z104*Y104+AA104*AD104)/(Y104+AA104)),Z104)","v":0.15},{"$f":"IFERROR(DISTANCE3BANDES(V104,distance),\"\")","v":12},"ESTIMEE",1,0.15,0,0,0,{"$f":"IFERROR(AB104/AC104,\"\")","v":""},{"$f":"IF(AJ104>0,IF(AF104=\"ESTIMEE\",AN104,DISTANCE5Q((AG104+AK104)/(AH104+AL104),distance)),AI104)","v":63},"ESTIMEE",63,null,{"$f":"IF(AH104=\"\",AG104,DISTANCE5Q(AG104/AH104,distance))","v":63},0,0,0,{"$f":"IFERROR(AK104/AL104,\"\")","v":""},{"$f":"IFERROR(DISTANCE5Q(AM104,distance),\"\")","v":""}]
["ARP","SERRA",{"$f":"IFERROR(IF(MATCH(Moyennes!B105,'nouveaux joueurs'!B:B,0) >1,\"nouveau joueur\",\"\"),\"\")","v":""},2.41,{"$f":"IFERROR(DISTANCELIBRE(D105,table),\"\")","v":87},"OFFICIELLE",1,2.41,0,0,0,"",0.76,{"$f":"IFERROR(DISTANCEBANDE(M105,distance),\"\")","v":38},"OFFICIELLE",1,0.76,0,0,0,"",0.2,{"$f":"IFERROR(DISTANCE3BANDES(V105,distance),\"\")","v":14},"ESTIMEE",1,0.2,0,0,0,"",{"$f":"IF(AJ105>0,IF(AF105=\"ESTIMEE\",AN105,DISTANCE5Q((AG105+AK105)/(AH105+AL105),distance)),AI105)","v":71},"ESTIMEE",71,null,{"$f":"IF(AH105=\"\",AG105,DISTANCE5Q(AG105/AH105,distance))","v":71},0,0,0,"",{"$f":"IFERROR(DISTANCE5Q(AM105,distance),\"\")","v":""}]
["DRA","TAVERNIER",{"$f":"IFERROR(IF(MATCH(Moyennes!B106,'nouveaux joueurs'!B:B,0) >1,\"nouveau joueur\",\"\"),\"\")","v":""},1.5,{"$f":"IFERROR(DISTANCELIBRE(D106,table),\"\")","v":64},"ESTIMEE",1,1.5,0,0,0,"",0.99494938132733413,{"$f":"IFERROR(DISTANCEBANDE(M106,distance),\"\")","v":43},"OFFICIELLE",1,1.1299999999999999,6,247,254,0.97244094488188981,0.3,{"$f":"IFERROR(DISTANCE3BANDES(V106,distance),\"\")","v":18},"OFFICIELLE",1,0.3,0,0,0,"",{"$f":"IF(AJ106>0,IF(AF106=\"ESTIMEE\",AN106,DISTANCE5Q((AG106+AK106)/(AH106+AL106),distance)),AI106)","v":67},"ESTIMEE",67,null,{"$f":"IF(AH106=\"\",AG106,DISTANCE5Q(AG106/AH106,distance))","v":67},0,0,0,"",{"$f":"IFERROR(DISTANCE5Q(AM106,distance),\"\")","v":""}]
["ARP","THENOT",{"$f":"IFERROR(IF(MATCH(Moyennes!B107,'nouveaux joueurs'!B:B,0) >1,\"nouveau joueur\",\"\"),\"\")","v":""},2.35,{"$f":"IFERROR(DISTANCELIBRE(D107,table),\"\")","v":85},"OFFICIELLE",1,2.35,0,0,0,"",1.27,{"$f":"IFERROR(DISTANCEBANDE(M107,distance),\"\")","v":48},"ESTIMEE",1,1.27,0,0,0,"",0.312,{"$f":"IFERROR(DISTANCE3BANDES(V107,distance),\"\")","v":18},"OFFICIELLE",1,0.312,0,0,0,"",{"$f":"IF(AJ107>0,IF(AF107=\"ESTIMEE\",AN107,DISTANCE5Q((AG107+AK107)/(AH107+AL107),distance)),AI107)","v":80},"ESTIMEE",70,null,{"$f":"IF(AH107=\"\",AG107,DISTANCE5Q(AG107/AH107,distance))","v":70},3,435,421,1.0332541567695963,{"$f":"IFERROR(DISTANCE5Q(AM107,distance),\"\")","v":80}]
["MOR","TIRITILLI",{"$f":"IFERROR(IF(MATCH(Moyennes!B108,'nouveaux joueurs'!B:B,0) >1,\"nouveau joueur\",\"\"),\"\")","v":""},0.5,{"$f":"IFERROR(DISTANCELIBRE(D108,table),\"\")","v":37},"ESTIMEE",1,0.5,0,0,0,"",0.35,{"$f":"IFERROR(DISTANCEBANDE(M108,distance),\"\")","v":30},"ESTIMEE",1,0.35,0,0,0,"",0.28000000000000003,{"$f":"IFERROR(DISTANCE3BANDES(V108,distance),\"\")","v":17},"ESTIMEE",1,0.28000000000000003,0,0,0,"",{"$f":"IF(AJ108>0,IF(AF108=\"ESTIMEE\",AN108,DISTANCE5Q((AG108+AK108)/(AH108+AL108),distance)),AI108)","v":62},"ESTIMEE",62,null,{"$f":"IF(AH108=\"\",AG108,DISTANCE5Q(AG108/AH108,distance))","v":62},0,0,0,"",{"$f":"IFERROR(DISTANCE5Q(AM108,distance),\"\")","v":""}]
["MAS","TRAN",{"$f":"IFERROR(IF(MATCH(Moyennes!B109,'nouveaux joueurs'!B:B,0) >1,\"nouveau joueur\",\"\"),\"\")","v":""},3.5,{"$f":"IFERROR(DISTANCELIBRE(D109,table),\"\")","v":111},"CDBE",1,3.5,0,0,0,"",2.27,{"$f":"IFERROR(DISTANCEBANDE(M109,distance),\"\")","v":66},"CDBE",1,2.27,0,0,0,"",0.38,{"$f":"IFERROR(DISTANCE3BANDES(V109,distance),\"\")","v":21},"CDBE",1,0.38,0,0,0,"",{"$f":"IF(AJ109>0,IF(AF109=\"ESTIMEE\",AN109,DISTANCE5Q((AG109+AK109)/(AH109+AL109),distance)),AI109)","v":76},"ESTIMEE",76,null,{"$f":"IF(AH109=\"\",AG109,DISTANCE5Q(AG109/AH109,distance))","v":76},0,0,0,"",{"$f":"IFERROR(DISTANCE5Q(AM109,distance),\"\")","v":""}]
["MOR","TRUFFAUT",{"$f":"IFERROR(IF(MATCH(Moyennes!B110,'nouveaux joueurs'!B:B,0) >1,\"nouveau joueur\",\"\"),\"\")","v":""},1.1399999999999999,{"$f":"IFERROR(DISTANCELIBRE(D110,table),\"\")","v":54},"ESTIMEE",1,1.1399999999999999,0,0,0,"",0.67,{"$f":"IFERROR(DISTANCEBANDE(M110,distance),\"\")","v":37},"OFFICIELLE",1,0.67,0,0,0,"",0.31,{"$f":"IFERROR(DISTANCE3BANDES(V110,distance),\"\")","v":18},"ESTIMEE",1,0.31,0,0,0,"",{"$f":"IF(AJ110>0,IF(AF110=\"ESTIMEE\",AN110,DISTANCE5Q((AG110+AK110)/(AH110+AL110),distance)),AI110)","v":110},"ESTIMEE",65,null,{"$f":"IF(AH110=\"\",AG110,DISTANCE5Q(AG110/AH110,distance))","v":65},1,130,47,2.7659574468085109,{"$f":"IFERROR(DISTANCE5Q(AM110,distance),\"\")","v":110}]
["MOR","VALLEE",{"$f":"IFERROR(IF(MATCH(Moyennes!B111,'nouveaux joueurs'!B:B,0) >1,\"nouveau joueur\",\"\"),\"\")","v":""},0.54249999999999998,{"$f":"IFERROR(DISTANCELIBRE(D111,table),\"\")","v":38},"OFFICIELLE",1,0.71,1,15,40,0.375,0.35,{"$f":"IFERROR(DISTANCEBANDE(M111,distance),\"\")","v":30},"CDBE",1,0.35,0,0,0,"",0.25,{"$f":"IFERROR(DISTANCE3BANDES(V111,distance),\"\")","v":16},"CDBE",1,0.25,0,0,0,"",{"$f":"IF(AJ111>0,IF(AF111=\"ESTIMEE\",AN111,DISTANCE5Q((AG111+AK111)/(AH111+AL111),distance)),AI111)","v":63},"ESTIMEE",63,null,{"$f":"IF(AH111=\"\",AG111,DISTANCE5Q(AG111/AH111,distance))","v":63},0,0,0,"",{"$f":"IFERROR(DISTANCE5Q(AM111,distance),\"\")","v":""}]
["MAS","VANHEE",{"$f":"IFERROR(IF(MATCH(Moyennes!B112,'nouveaux joueurs'!B:B,0) >1,\"nouveau joueur\",\"\"),\"\")","v":""},0.45999999999999996,{"$f":"IFERROR(DISTANCELIBRE(D112,table),\"\")","v":36},"OFFICIELLE",1,0.42,1,23,46,0.5,0.25615615615615611,{"$f":"IFERROR(DISTANCEBANDE(M112,distance),\"\")","v":28},"CDBE",1,0.3,2,26,111,0.23423423423423423,1E-3,{"$f":"IFERROR(DISTANCE3BANDES(V112,distance),\"\")","v":8},"ESTIMEE",1,1E-3,0,0,0,"",{"$f":"IF(AJ112>0,IF(AF112=\"ESTIMEE\",AN112,DISTANCE5Q((AG112+AK112)/(AH112+AL112),distance)),AI112)","v":62},"ESTIMEE",62,null,{"$f":"IF(AH112=\"\",AG112,DISTANCE5Q(AG112/AH112,distance))","v":62},0,0,0,"",{"$f":"IFERROR(DISTANCE5Q(AM112,distance),\"\")","v":""}]
["VIG","VENOT",{"$f":"IFERROR(IF(MATCH(Moyennes!B113,'nouveaux joueurs'!B:B,0) >1,\"nouveau joueur\",\"\"),\"\")","v":"nouveau joueur"},{"$f":"IF(I113>0,IF(F113=\"ESTIMEE\",L113,(H113*G113+I113*L113)/(G113+I113)),H113)","v":1.2},{"$f":"IFERROR(DISTANCELIBRE(D113,table),\"\")","v":56},"OFFICIELLE",1,1.2,0,0,0,{"$f":"IFERROR(J113/K113,\"\")","v":""},{"$f":"IF(R113>0,IF(O113=\"ESTIMEE\",U113,(Q113*P113+R113*U113)/(P113+R113)),Q113)","v":0.39},{"$f":"IFERROR(DISTANCEBANDE(M113,distance),\"\")","v":31},"OFFICIELLE",1,0.5,1,14,50,{"$f":"IFERROR(S113/T113,\"\")","v":0.28000000000000003},{"$f":"IF(AA113>0,IF(X113=\"ESTIMEE\",AD113,(Z113*Y113+AA113*AD113)/(Y113+AA113)),Z113)","v":0.44500000000000001},{"$f":"IFERROR(DISTANCE3BANDES(V113,distance),\"\")","v":24},"OFFICIELLE",1,0.44500000000000001,0,0,0,{"$f":"IFERROR(AB113/AC113,\"\")","v":""},{"$f":"IF(AJ113>0,IF(AF113=\"ESTIMEE\",AN113,DISTANCE5Q((AG113+AK113)/(AH113+AL113),distance)),AI113)","v":66},"ESTIMEE",65,null,{"$f":"IF(AH113=\"\",AG113,DISTANCE5Q(AG113/AH113,distance))","v":65},3,298,401,{"$f":"IFERROR(AK113/AL113,\"\")","v":0.743142144638404},{"$f":"IFERROR(DISTANCE5Q(AM113,distance),\"\")","v":66}]
["ETR","VERLEY",{"$f":"IFERROR(IF(MATCH(Moyennes!B114,'nouveaux joueurs'!B:B,0) >1,\"nouveau joueur\",\"\"),\"\")","v":""},1.42,{"$f":"IFERROR(DISTANCELIBRE(D114,table),\"\")","v":62},"OFFICIELLE",1,1.42,0,0,0,"",1.21,{"$f":"IFERROR(DISTANCEBANDE(M114,distance),\"\")","v":47},"OFFICIELLE",1,1.21,0,0,0,"",0.35095556617295748,{"$f":"IFERROR(DISTANCE3BANDES(V114,distance),\"\")","v":20},"OFFICIELLE",1,0.45,6,100,299,0.33444816053511706,{"$f":"IF(AJ114>0,IF(AF114=\"ESTIMEE\",AN114,DISTANCE5Q((AG114+AK114)/(AH114+AL114),distance)),AI114)","v":66},"ESTIMEE",66,null,{"$f":"IF(AH114=\"\",AG114,DISTANCE5Q(AG114/AH114,distance))","v":66},0,0,0,"",{"$f":"IFERROR(DISTANCE5Q(AM114,distance),\"\")","v":""}]
["MOR","VICARI",{"$f":"IFERROR(IF(MATCH(Moyennes!B115,'nouveaux joueurs'!B:B,0) >1,\"nouveau joueur\",\"\"),\"\")","v":""},5.4960280759702727,{"$f":"IFERROR(DISTANCELIBRE(D115,table),\"\")","v":146},"OFFICIELLE",1,6.53,6,921,173,5.3236994219653182,"NC",{"$f":"IFERROR(DISTANCEBANDE(M115,distance),\"\")","v":""},null,1,"NC",0,0,0,"","NC",{"$f":"IFERROR(DISTANCE3BANDES(V115,distance),\"\")","v":""},null,1,"NC",0,0,0,"",{"$f":"IF(AJ115>0,IF(AF115=\"ESTIMEE\",AN115,DISTANCE5Q((AG115+AK115)/(AH115+AL115),distance)),AI115)","v":"NC"},"ESTIMEE","NC",null,{"$f":"IF(AH115=\"\",AG115,DISTANCE5Q(AG115/AH115,distance))","v":"NC"},0,0,0,"",{"$f":"IFERROR(DISTANCE5Q(AM115,distance),\"\")","v":""}]
["ARP","VIGNON",{"$f":"IFERROR(IF(MATCH(Moyennes!B116,'nouveaux joueurs'!B:B,0) >1,\"nouveau joueur\",\"\"),\"\")","v":""},1.6720105820105822,{"$f":"IFERROR(DISTANCELIBRE(D116,table),\"\")","v":68},"OFFICIELLE",1,1.27,2,118,63,1.873015873015873,0.69602409638554219,{"$f":"IFERROR(DISTANCEBANDE(M116,distance),\"\")","v":37},"CDBE",1,0.56999999999999995,2,63,83,0.75903614457831325,0.13,{"$f":"IFERROR(DISTANCE3BANDES(V116,distance),\"\")","v":11},"CDBE",1,0.13,0,0,0,"",{"$f":"IF(AJ116>0,IF(AF116=\"ESTIMEE\",AN116,DISTANCE5Q((AG116+AK116)/(AH116+AL116),distance)),AI116)","v":68},"ESTIMEE",60,null,{"$f":"IF(AH116=\"\",AG116,DISTANCE5Q(AG116/AH116,distance))","v":60},1,120,152,0.78947368421052633,{"$f":"IFERROR(DISTANCE5Q(AM116,distance),\"\")","v":68}]
["MOR","VILLET",{"$f":"IFERROR(IF(MATCH(Moyennes!B117,'nouveaux joueurs'!B:B,0) >1,\"nouveau joueur\",\"\"),\"\")","v":""},{"$f":"IF(I117>0,IF(F117=\"ESTIMEE\",L117,(H117*G117+I117*L117)/(G117+I117)),H117)","v":1.4},{"$f":"IFERROR(DISTANCELIBRE(D117,table),\"\")","v":61},"OFFICIELLE",1,1.4,0,0,0,{"$f":"IFERROR(J117/K117,\"\")","v":""},{"$f":"IF(R117>0,IF(O117=\"ESTIMEE\",U117,(Q117*P117+R117*U117)/(P117+R117)),Q117)","v":0.76080586080586077},{"$f":"IFERROR(DISTANCEBANDE(M117,distance),\"\")","v":38},"OFFICIELLE",1,0.7,2,72,91,{"$f":"IFERROR(S117/T117,\"\")","v":0.79120879120879117},{"$f":"IF(AA117>0,IF(X117=\"ESTIMEE\",AD117,(Z117*Y117+AA117*AD117)/(Y117+AA117)),Z117)","v":0.15},{"$f":"IFERROR(DISTANCE3BANDES(V117,distance),\"\")","v":12},"OFFICIELLE",1,0.15,0,0,0,{"$f":"IFERROR(AB117/AC117,\"\")","v":""},{"$f":"IF(AJ117>0,IF(AF117=\"ESTIMEE\",AN117,DISTANCE5Q((AG117+AK117)/(AH117+AL117),distance)),AI117)","v":66},"ESTIMEE",66,null,{"$f":"IF(AH117=\"\",AG117,DISTANCE5Q(AG117/AH117,distance))","v":66},0,0,0,{"$f":"IFERROR(AK117/AL117,\"\")","v":""},{"$f":"IFERROR(DISTANCE5Q(AM117,distance),\"\")","v":""}]
["MOR","VINGUEASSALOM",{"$f":"IFERROR(IF(MATCH(Moyennes!B118,'nouveaux joueurs'!B:B,0) >1,\"nouveau joueur\",\"\"),\"\")","v":""},1.9324242424242424,{"$f":"IFERROR(DISTANCELIBRE(D118,table),\"\")","v":75},"OFFICIELLE",1,2.3199999999999998,2,153,88,1.7386363636363635,1.1191666666666666,{"$f":"IFERROR(DISTANCEBANDE(M118,distance),\"\")","v":45},"OFFICIELLE",1,1.06,3,123,108,1.1388888888888888,0.36,{"$f":"IFERROR(DISTANCE3BANDES(V118,distance),\"\")","v":20},"OFFICIELLE",1,0.36,0,0,0,"",{"$f":"IF(AJ118>0,IF(AF118=\"ESTIMEE\",AN118,DISTANCE5Q((AG118+AK118)/(AH118+AL118),distance)),AI118)","v":70},"ESTIMEE",70,null,{"$f":"IF(AH118=\"\",AG118,DISTANCE5Q(AG118/AH118,distance))","v":70},0,0,0,"",{"$f":"IFERROR(DISTANCE5Q(AM118,distance),\"\")","v":""}]
["DRA","VIVENOT",{"$f":"IFERROR(IF(MATCH(Moyennes!B119,'nouveaux joueurs'!B:B,0) >1,\"nouveau joueur\",\"\"),\"\")","v":""},0.65,{"$f":"IFERROR(DISTANCELIBRE(D119,table),\"\")","v":41},"CDBE",1,0.65,0,0,0,"",0.55000000000000004,{"$f":"IFERROR(DISTANCEBANDE(M119,distance),\"\")","v":34},"CDBE",1,0.55000000000000004,0,0,0,"",0.2,{"$f":"IFERROR(DISTANCE3BANDES(V119,distance),\"\")","v":14},"CDBE",1,0.2,0,0,0,"",{"$f":"IF(AJ119>0,IF(AF119=\"ESTIMEE\",AN119,DISTANCE5Q((AG119+AK119)/(AH119+AL119),distance)),AI119)","v":60},"ESTIMEE",60,null,{"$f":"IF(AH119=\"\",AG119,DISTANCE5Q(AG119/AH119,distance))","v":60},0,0,0,"",{"$f":"IFERROR(DISTANCE5Q(AM119,distance),\"\")","v":""}]
["COR","WEBER",{"$f":"IFERROR(IF(MATCH(Moyennes!B120,'nouveaux joueurs'!B:B,0) >1,\"nouveau joueur\",\"\"),\"\")","v":""},1.27,{"$f":"IFERROR(DISTANCELIBRE(D120,table),\"\")","v":58},"OFFICIELLE",1,1.27,0,0,0,"",1.05,{"$f":"IFERROR(DISTANCEBANDE(M120,distance),\"\")","v":44},"CDBE",1,1.05,0,0,0,"",0.21299999999999999,{"$f":"IFERROR(DISTANCE3BANDES(V120,distance),\"\")","v":14},"OFFICIELLE",1,0.21299999999999999,0,0,0,"",{"$f":"IF(AJ120>0,IF(AF120=\"ESTIMEE\",AN120,DISTANCE5Q((AG120+AK120)/(AH120+AL120),distance)),AI120)","v":66},"ESTIMEE",66,null,{"$f":"IF(AH120=\"\",AG120,DISTANCE5Q(AG120/AH120,distance))","v":66},0,0,0,"",{"$f":"IFERROR(DISTANCE5Q(AM120,distance),\"\")","v":""}]
["MAS","XANH",{"$f":"IFERROR(IF(MATCH(Moyennes!B121,'nouveaux joueurs'!B:B,0) >1,\"nouveau joueur\",\"\"),\"\")","v":""},2.02,{"$f":"IFERROR(DISTANCELIBRE(D121,table),\"\")","v":77},"CDBE",1,2.02,0,0,0,"",1,{"$f":"IFERROR(DISTANCEBANDE(M121,distance),\"\")","v":43},"CDBE",1,1,0,0,0,"",0.1,{"$f":"IFERROR(DISTANCE3BANDES(V121,distance),\"\")","v":11},"CDBE",1,0.1,0,0,0,"",{"$f":"IF(AJ121>0,IF(AF121=\"ESTIMEE\",AN121,DISTANCE5Q((AG121+AK121)/(AH121+AL121),distance)),AI121)","v":63},"ESTIMEE",63,null,{"$f":"IF(AH121=\"\",AG121,DISTANCE5Q(AG121/AH121,distance))","v":63},0,0,0,"",{"$f":"IFERROR(DISTANCE5Q(AM121,distance),\"\")","v":""}]
[null,"-",{"$f":"IFERROR(IF(MATCH(Moyennes!B122,'nouveaux joueurs'!B:B,0) >1,\"nouveau joueur\",\"\"),\"\")","v":""},"NC",{"$f":"IFERROR(DISTANCELIBRE(D122,table),\"\")","v":""},null,null,"NC",0,0,0,{"$f":"IFERROR(J122/K122,\"\")","v":""},"NC",{"$f":"IFERROR(DISTANCEBANDE(M122,distance),\"\")","v":""},null,null,"NC",0,0,0,{"$f":"IFERROR(S122/T122,\"\")","v":""},{"$f":"IF(AA122>=Ponderation,AD122,IF(AA122>0,(AB122+(Ponderation-AA122)*Z122*(AC122/AA122))/(Ponderation*AC122/AA122),IF(Z122=\"\",\"NC\",Z122)))","v":""},{"$f":"IFERROR(DISTANCE3BANDES(V122,distance),\"\")","v":""},null,null,"NC",0,0,0,{"$f":"IFERROR(AB122/AC122,\"\")","v":""},{"$f":"IF(AJ122>0,IF(AF122=\"ESTIMEE\",AN122,DISTANCE5Q((AG122+AK122)/(AH122+AL122),distance)),AI122)","v":"NC"},null,"NC",null,{"$f":"IF(AH122=\"\",AG122,DISTANCE5Q(AG122/AH122,distance))","v":"NC"},0,0,0,"",{"$f":"IFERROR(DISTANCE5Q(AM122,distance),\"\")","v":""}]
[null,"-",{"$f":"IFERROR(IF(MATCH(Moyennes!B123,'nouveaux joueurs'!B:B,0) >1,\"nouveau joueur\",\"\"),\"\")","v":""},"NC",{"$f":"IFERROR(DISTANCELIBRE(D123,table),\"\")","v":""},null,null,"NC",0,0,0,{"$f":"IFERROR(J123/K123,\"\")","v":""},"NC",{"$f":"IFERROR(DISTANCEBANDE(M123,distance),\"\")","v":""},null,null,"NC",0,0,0,{"$f":"IFERROR(S123/T123,\"\")","v":""},{"$f":"IF(AA123>=Ponderation,AD123,IF(AA123>0,(AB123+(Ponderation-AA123)*Z123*(AC123/AA123))/(Ponderation*AC123/AA123),IF(Z123=\"\",\"NC\",Z123)))","v":""},{"$f":"IFERROR(DISTANCE3BANDES(V123,distance),\"\")","v":""},null,null,"NC",0,0,0,{"$f":"IFERROR(AB123/AC123,\"\")","v":""},{"$f":"IF(AJ123>0,IF(AF123=\"ESTIMEE\",AN123,DISTANCE5Q((AG123+AK123)/(AH123+AL123),distance)),AI123)","v":"NC"},null,"NC",null,{"$f":"IF(AH123=\"\",AG123,DISTANCE5Q(AG123/AH123,distance))","v":"NC"},null,null,null,null,{"$f":"IFERROR(DISTANCE5Q(AM123,distance),\"\")","v":60}]
[null,"-",{"$f":"IFERROR(IF(MATCH(Moyennes!B124,'nouveaux joueurs'!B:B,0) >1,\"nouveau joueur\",\"\"),\"\")","v":""},"NC",{"$f":"IFERROR(DISTANCELIBRE(D124,table),\"\")","v":""},null,null,"NC",0,0,0,"","NC",{"$f":"IFERROR(DISTANCEBANDE(M124,distance),\"\")","v":""},null,null,"NC",0,0,0,"","",{"$f":"IFERROR(DISTANCE3BANDES(V124,distance),\"\")","v":""},null,null,"NC",0,0,0,"",{"$f":"IF(AJ124>0,IF(AF124=\"ESTIMEE\",AN124,DISTANCE5Q((AG124+AK124)/(AH124+AL124),distance)),AI124)","v":"NC"},null,"NC",null,{"$f":"IF(AH124=\"\",AG124,DISTANCE5Q(AG124/AH124,distance))","v":"NC"},null,null,null,null,{"$f":"IFERROR(DISTANCE5Q(AM124,distance),\"\")","v":60}]
[null,"-",{"$f":"IFERROR(IF(MATCH(Moyennes!B125,'nouveaux joueurs'!B:B,0) >1,\"nouveau joueur\",\"\"),\"\")","v":""},"NC",{"$f":"IFERROR(DISTANCELIBRE(D125,table),\"\")","v":""},null,null,"NC",0,0,0,"","NC",{"$f":"IFERROR(DISTANCEBANDE(M125,distance),\"\")","v":""},null,null,"NC",0,0,0,"","",{"$f":"IFERROR(DISTANCE3BANDES(V125,distance),\"\")","v":""},null,null,"NC",0,0,0,"",{"$f":"IF(AJ125>0,IF(AF125=\"ESTIMEE\",AN125,DISTANCE5Q((AG125+AK125)/(AH125+AL125),distance)),AI125)","v":"NC"},null,"NC",null,{"$f":"IF(AH125=\"\",AG125,DISTANCE5Q(AG125/AH125,distance))","v":"NC"},null,null,null,null,{"$f":"IFERROR(DISTANCE5Q(AM125,distance),\"\")","v":60}]
[null,"-",{"$f":"IFERROR(IF(MATCH(Moyennes!B126,'nouveaux joueurs'!B:B,0) >1,\"nouveau joueur\",\"\"),\"\")","v":""},"NC",{"$f":"IFERROR(DISTANCELIBRE(D126,table),\"\")","v":""},null,null,"NC",0,0,0,"","NC",{"$f":"IFERROR(DISTANCEBANDE(M126,distance),\"\")","v":""},null,null,"NC",0,0,0,"","",{"$f":"IFERROR(DISTANCE3BANDES(V126,distance),\"\")","v":""},null,null,"NC",0,0,0,"",{"$f":"IF(AJ126>0,IF(AF126=\"ESTIMEE\",AN126,DISTANCE5Q((AG126+AK126)/(AH126+AL126),distance)),AI126)","v":"NC"},null,"NC",null,{"$f":"IF(AH126=\"\",AG126,DISTANCE5Q(AG126/AH126,distance))","v":"NC"},null,null,null,null,{"$f":"IFERROR(DISTANCE5Q(AM126,distance),\"\")","v":60}]
[null,"-",{"$f":"IFERROR(IF(MATCH(Moyennes!B127,'nouveaux joueurs'!B:B,0) >1,\"nouveau joueur\",\"\"),\"\")","v":""},"NC",{"$f":"IFERROR(DISTANCELIBRE(D127,table),\"\")","v":""},null,null,"NC",0,0,0,"","NC",{"$f":"IFERROR(DISTANCEBANDE(M127,distance),\"\")","v":""},null,null,"NC",0,0,0,"","",{"$f":"IFERROR(DISTANCE3BANDES(V127,distance),\"\")","v":""},null,null,"NC",0,0,0,"",{"$f":"IF(AJ127>0,IF(AF127=\"ESTIMEE\",AN127,DISTANCE5Q((AG127+AK127)/(AH127+AL127),distance)),AI127)","v":"NC"},null,"NC",null,{"$f":"IF(AH127=\"\",AG127,DISTANCE5Q(AG127/AH127,distance))","v":"NC"},null,null,null,null,{"$f":"IFERROR(DISTANCE5Q(AM127,distance),\"\")","v":60}]
[null,"-",{"$f":"IFERROR(IF(MATCH(Moyennes!B128,'nouveaux joueurs'!B:B,0) >1,\"nouveau joueur\",\"\"),\"\")","v":""},"NC",{"$f":"IFERROR(DISTANCELIBRE(D128,table),\"\")","v":""},null,null,"NC",0,0,0,"","NC",{"$f":"IFERROR(DISTANCEBANDE(M128,distance),\"\")","v":""},null,null,"NC",0,0,0,"","",{"$f":"IFERROR(DISTANCE3BANDES(V128,distance),\"\")","v":""},null,null,"NC",0,0,0,"",{"$f":"IF(AJ128>0,IF(AF128=\"ESTIMEE\",AN128,DISTANCE5Q((AG128+AK128)/(AH128+AL128),distance)),AI128)","v":"NC"},null,"NC",null,{"$f":"IF(AH128=\"\",AG128,DISTANCE5Q(AG128/AH128,distance))","v":"NC"},null,null,null,null,{"$f":"IFERROR(DISTANCE5Q(AM128,distance),\"\")","v":60}]
[null,"-",{"$f":"IFERROR(IF(MATCH(Moyennes!B129,'nouveaux joueurs'!B:B,0) >1,\"nouveau joueur\",\"\"),\"\")","v":""},"NC",{"$f":"IFERROR(DISTANCELIBRE(D129,table),\"\")","v":""},null,null,"NC",0,0,0,"","NC",{"$f":"IFERROR(DISTANCEBANDE(M129,distance),\"\")","v":""},null,null,"NC",0,0,0,"","",{"$f":"IFERROR(DISTANCE3BANDES(V129,distance),\"\")","v":""},null,null,"NC",0,0,0,"",{"$f":"IF(AJ129>0,IF(AF129=\"ESTIMEE\",AN129,DISTANCE5Q((AG129+AK129)/(AH129+AL129),distance)),AI129)","v":"NC"},null,"NC",null,{"$f":"IF(AH129=\"\",AG129,DISTANCE5Q(AG129/AH129,distance))","v":"NC"},null,null,null,null,{"$f":"IFERROR(DISTANCE5Q(AM129,distance),\"\")","v":60}]
[null,"-",{"$f":"IFERROR(IF(MATCH(Moyennes!B130,'nouveaux joueurs'!B:B,0) >1,\"nouveau joueur\",\"\"),\"\")","v":""},"NC",{"$f":"IFERROR(DISTANCELIBRE(D130,table),\"\")","v":""},null,null,"NC",0,0,0,"","NC",{"$f":"IFERROR(DISTANCEBANDE(M130,distance),\"\")","v":""},null,null,"NC",0,0,0,"","",{"$f":"IFERROR(DISTANCE3BANDES(V130,distance),\"\")","v":""},null,null,"NC",0,0,0,"",{"$f":"IF(AJ130>0,IF(AF130=\"ESTIMEE\",AN130,DISTANCE5Q((AG130+AK130)/(AH130+AL130),distance)),AI130)","v":"NC"},null,"NC",null,{"$f":"IF(AH130=\"\",AG130,DISTANCE5Q(AG130/AH130,distance))","v":"NC"},null,null,null,null,{"$f":"IFERROR(DISTANCE5Q(AM130,distance),\"\")","v":60}]
[null,"-",{"$f":"IFERROR(IF(MATCH(Moyennes!B131,'nouveaux joueurs'!B:B,0) >1,\"nouveau joueur\",\"\"),\"\")","v":""},"NC",{"$f":"IFERROR(DISTANCELIBRE(D131,table),\"\")","v":""},null,null,"NC",0,0,0,"","NC",{"$f":"IFERROR(DISTANCEBANDE(M131,distance),\"\")","v":""},null,null,"NC",0,0,0,"","",{"$f":"IFERROR(DISTANCE3BANDES(V131,distance),\"\")","v":""},null,null,"NC",0,0,0,"",{"$f":"IF(AJ131>0,IF(AF131=\"ESTIMEE\",AN131,DISTANCE5Q((AG131+AK131)/(AH131+AL131),distance)),AI131)","v":"NC"},null,"NC",null,{"$f":"IF(AH131=\"\",AG131,DISTANCE5Q(AG131/AH131,distance))","v":"NC"},null,null,null,null,{"$f":"IFERROR(DISTANCE5Q(AM131,distance),\"\")","v":60}]
[null,"-",{"$f":"IFERROR(IF(MATCH(Moyennes!B132,'nouveaux joueurs'!B:B,0) >1,\"nouveau joueur\",\"\"),\"\")","v":""},"NC",{"$f":"IFERROR(DISTANCELIBRE(D132,table),\"\")","v":""},null,null,"NC",0,0,0,"","NC",{"$f":"IFERROR(DISTANCEBANDE(M132,distance),\"\")","v":""},null,null,"NC",0,0,0,"","",{"$f":"IFERROR(DISTANCE3BANDES(V132,distance),\"\")","v":""},null,null,"NC",0,0,0,"",{"$f":"IF(AJ132>0,IF(AF132=\"ESTIMEE\",AN132,DISTANCE5Q((AG132+AK132)/(AH132+AL132),distance)),AI132)","v":"NC"},null,"NC",null,{"$f":"IF(AH132=\"\",AG132,DISTANCE5Q(AG132/AH132,distance))","v":"NC"},null,null,null,null,{"$f":"IFERROR(DISTANCE5Q(AM132,distance),\"\")","v":60}]
[null,"-",{"$f":"IFERROR(IF(MATCH(Moyennes!B133,'nouveaux joueurs'!B:B,0) >1,\"nouveau joueur\",\"\"),\"\")","v":""},"NC",{"$f":"IFERROR(DISTANCELIBRE(D133,table),\"\")","v":""},null,null,"NC",0,0,0,"","NC",{"$f":"IFERROR(DISTANCEBANDE(M133,distance),\"\")","v":""},null,null,"NC",0,0,0,"","",{"$f":"IFERROR(DISTANCE3BANDES(V133,distance),\"\")","v":""},null,null,"NC",0,0,0,"",{"$f":"IF(AJ133>0,IF(AF133=\"ESTIMEE\",AN133,DISTANCE5Q((AG133+AK133)/(AH133+AL133),distance)),AI133)","v":"NC"},null,"NC",null,{"$f":"IF(AH133=\"\",AG133,DISTANCE5Q(AG133/AH133,distance))","v":"NC"},null,null,null,null,{"$f":"IFERROR(DISTANCE5Q(AM133,distance),\"\")","v":60}]
[null,"-",{"$f":"IFERROR(IF(MATCH(Moyennes!B134,'nouveaux joueurs'!B:B,0) >1,\"nouveau joueur\",\"\"),\"\")","v":""},"NC",{"$f":"IFERROR(DISTANCELIBRE(D134,table),\"\")","v":""},null,null,"NC",0,0,0,"","NC",{"$f":"IFERROR(DISTANCEBANDE(M134,distance),\"\")","v":""},null,null,"NC",0,0,0,"","",{"$f":"IFERROR(DISTANCE3BANDES(V134,distance),\"\")","v":""},null,null,"NC",0,0,0,"",{"$f":"IF(AJ134>0,IF(AF134=\"ESTIMEE\",AN134,DISTANCE5Q((AG134+AK134)/(AH134+AL134),distance)),AI134)","v":"NC"},null,"NC",null,{"$f":"IF(AH134=\"\",AG134,DISTANCE5Q(AG134/AH134,distance))","v":"NC"},null,null,null,null,{"$f":"IFERROR(DISTANCE5Q(AM134,distance),\"\")","v":60}]
[null,"-",{"$f":"IFERROR(IF(MATCH(Moyennes!B135,'nouveaux joueurs'!B:B,0) >1,\"nouveau joueur\",\"\"),\"\")","v":""},"NC",{"$f":"IFERROR(DISTANCELIBRE(D135,table),\"\")","v":""},null,null,"NC",0,0,0,"","NC",{"$f":"IFERROR(DISTANCEBANDE(M135,distance),\"\")","v":""},null,null,"NC",0,0,0,"","",{"$f":"IFERROR(DISTANCE3BANDES(V135,distance),\"\")","v":""},null,null,"NC",0,0,0,"",{"$f":"IF(AJ135>0,IF(AF135=\"ESTIMEE\",AN135,DISTANCE5Q((AG135+AK135)/(AH135+AL135),distance)),AI135)","v":"NC"},null,"NC",null,{"$f":"IF(AH135=\"\",AG135,DISTANCE5Q(AG135/AH135,distance))","v":"NC"},null,null,null,null,{"$f":"IFERROR(DISTANCE5Q(AM135,distance),\"\")","v":60}]
[null,"-",{"$f":"IFERROR(IF(MATCH(Moyennes!B136,'nouveaux joueurs'!B:B,0) >1,\"nouveau joueur\",\"\"),\"\")","v":""},"NC",{"$f":"IFERROR(DISTANCELIBRE(D136,table),\"\")","v":""},null,null,"NC",0,0,0,"","NC",{"$f":"IFERROR(DISTANCEBANDE(M136,distance),\"\")","v":""},null,null,"NC",0,0,0,"","",{"$f":"IFERROR(DISTANCE3BANDES(V136,distance),\"\")","v":""},null,null,"NC",0,0,0,"",{"$f":"IF(AJ136>0,IF(AF136=\"ESTIMEE\",AN136,DISTANCE5Q((AG136+AK136)/(AH136+AL136),distance)),AI136)","v":"NC"},null,"NC",null,{"$f":"IF(AH136=\"\",AG136,DISTANCE5Q(AG136/AH136,distance))","v":"NC"},null,null,null,null,{"$f":"IFERROR(DISTANCE5Q(AM136,distance),\"\")","v":60}]
[null,"-",{"$f":"IFERROR(IF(MATCH(Moyennes!B137,'nouveaux joueurs'!B:B,0) >1,\"nouveau joueur\",\"\"),\"\")","v":""},{"$f":"IF(I137>0,IF(F137=\"ESTIMEE\",L137,(H137*G137+I137*L137)/(G137+I137)),H137)","v":"NC"},{"$f":"IFERROR(DISTANCELIBRE(D137,table),\"\")","v":""},null,null,"NC",0,0,0,"",{"$f":"IF(R137>0,IF(O137=\"ESTIMEE\",U137,(Q137*P137+R137*U137)/(P137+R137)),Q137)","v":"NC"},{"$f":"IFERROR(DISTANCEBANDE(M137,distance),\"\")","v":""},null,null,"NC",0,0,0,"","",{"$f":"IFERROR(DISTANCE3BANDES(V137,distance),\"\")","v":""},null,null,"NC",0,0,0,"",{"$f":"IF(AJ137>0,IF(AF137=\"ESTIMEE\",AN137,DISTANCE5Q((AG137+AK137)/(AH137+AL137),distance)),AI137)","v":"NC"},null,"NC",null,{"$f":"IF(AH137=\"\",AG137,DISTANCE5Q(AG137/AH137,distance))","v":"NC"},null,null,null,null,{"$f":"IFERROR(DISTANCE5Q(AM137,distance),\"\")","v":60}]
[null,"-",{"$f":"IFERROR(IF(MATCH(Moyennes!B138,'nouveaux joueurs'!B:B,0) >1,\"nouveau joueur\",\"\"),\"\")","v":""},"NC",{"$f":"IFERROR(DISTANCELIBRE(D138,table),\"\")","v":""},null,null,"NC",0,0,0,"","NC",{"$f":"IFERROR(DISTANCEBANDE(M138,distance),\"\")","v":""},null,null,"NC",0,0,0,"","",{"$f":"IFERROR(DISTANCE3BANDES(V138,distance),\"\")","v":""},null,null,"NC",0,0,0,"",{"$f":"IF(AJ138>0,IF(AF138=\"ESTIMEE\",AN138,DISTANCE5Q((AG138+AK138)/(AH138+AL138),distance)),AI138)","v":"NC"},null,"NC",null,{"$f":"IF(AH138=\"\",AG138,DISTANCE5Q(AG138/AH138,distance))","v":"NC"},null,null,null,null,{"$f":"IFERROR(DISTANCE5Q(AM138,distance),\"\")","v":60}]
[null,"-",{"$f":"IFERROR(IF(MATCH(Moyennes!B139,'nouveaux joueurs'!B:B,0) >1,\"nouveau joueur\",\"\"),\"\")","v":""},"NC",{"$f":"IFERROR(DISTANCELIBRE(D139,table),\"\")","v":""},null,null,"NC",0,0,0,"","NC",{"$f":"IFERROR(DISTANCEBANDE(M139,distance),\"\")","v":""},null,null,"NC",0,0,0,"","",{"$f":"IFERROR(DISTANCE3BANDES(V139,distance),\"\")","v":""},null,null,"NC",0,0,0,"",{"$f":"IF(AJ139>0,IF(AF139=\"ESTIMEE\",AN139,DISTANCE5Q((AG139+AK139)/(AH139+AL139),distance)),AI139)","v":"NC"},null,"NC",null,{"$f":"IF(AH139=\"\",AG139,DISTANCE5Q(AG139/AH139,distance))","v":"NC"},null,null,null,null,{"$f":"IFERROR(DISTANCE5Q(AM139,distance),\"\")","v":60}]
[null,"-",{"$f":"IFERROR(IF(MATCH(Moyennes!B140,'nouveaux joueurs'!B:B,0) >1,\"nouveau joueur\",\"\"),\"\")","v":""},"NC",{"$f":"IFERROR(DISTANCELIBRE(D140,table),\"\")","v":""},null,null,"NC",0,0,0,"","NC",{"$f":"IFERROR(DISTANCEBANDE(M140,distance),\"\")","v":""},null,null,"NC",0,0,0,"","",{"$f":"IFERROR(DISTANCE3BANDES(V140,distance),\"\")","v":""},null,null,"NC",0,0,0,"",{"$f":"IF(AJ140>0,IF(AF140=\"ESTIMEE\",AN140,DISTANCE5Q((AG140+AK140)/(AH140+AL140),distance)),AI140)","v":"NC"},null,"NC",null,{"$f":"IF(AH140=\"\",AG140,DISTANCE5Q(AG140/AH140,distance))","v":"NC"},null,null,null,null,{"$f":"IFERROR(DISTANCE5Q(AM140,distance),\"\")","v":60}]
[null,"-",{"$f":"IFERROR(IF(MATCH(Moyennes!B141,'nouveaux joueurs'!B:B,0) >1,\"nouveau joueur\",\"\"),\"\")","v":""},"NC",{"$f":"IFERROR(DISTANCELIBRE(D141,table),\"\")","v":""},null,null,"NC",0,0,0,{"$f":"IFERROR(J141/K141,\"\")","v":""},"NC",{"$f":"IFERROR(DISTANCEBANDE(M141,distance),\"\")","v":""},null,null,"NC",0,0,0,{"$f":"IFERROR(S141/T141,\"\")","v":""},"",{"$f":"IFERROR(DISTANCE3BANDES(V141,distance),\"\")","v":""},null,null,"NC",0,0,0,{"$f":"IFERROR(AB141/AC141,\"\")","v":""},{"$f":"IF(AJ141>0,IF(AF141=\"ESTIMEE\",AN141,DISTANCE5Q((AG141+AK141)/(AH141+AL141),distance)),AI141)","v":"NC"},null,"NC",null,{"$f":"IF(AH141=\"\",AG141,DISTANCE5Q(AG141/AH141,distance))","v":"NC"},0,0,0,"",{"$f":"IFERROR(DISTANCE5Q(AM141,distance),\"\")","v":""}]
[null,"-",{"$f":"IFERROR(IF(MATCH(Moyennes!B142,'nouveaux joueurs'!B:B,0) >1,\"nouveau joueur\",\"\"),\"\")","v":""},"NC",{"$f":"IFERROR(DISTANCELIBRE(D142,table),\"\")","v":""},null,null,"NC",0,0,0,"","NC",{"$f":"IFERROR(DISTANCEBANDE(M142,distance),\"\")","v":""},null,null,"NC",0,0,0,"","",{"$f":"IFERROR(DISTANCE3BANDES(V142,distance),\"\")","v":""},null,null,"NC",0,0,0,"",{"$f":"IF(AJ142>0,IF(AF142=\"ESTIMEE\",AN142,DISTANCE5Q((AG142+AK142)/(AH142+AL142),distance)),AI142)","v":"NC"},null,"NC",null,{"$f":"IF(AH142=\"\",AG142,DISTANCE5Q(AG142/AH142,distance))","v":"NC"},0,0,0,"",{"$f":"IFERROR(DISTANCE5Q(AM142,distance),\"\")","v":""}]
[null,"-",{"$f":"IFERROR(IF(MATCH(Moyennes!B143,'nouveaux joueurs'!B:B,0) >1,\"nouveau joueur\",\"\"),\"\")","v":""},"NC",{"$f":"IFERROR(DISTANCELIBRE(D143,table),\"\")","v":""},null,null,"NC",0,0,0,"","NC",{"$f":"IFERROR(DISTANCEBANDE(M143,distance),\"\")","v":""},null,null,"NC",0,0,0,"","",{"$f":"IFERROR(DISTANCE3BANDES(V143,distance),\"\")","v":""},null,null,"NC",0,0,0,"",{"$f":"IF(AJ143>0,IF(AF143=\"ESTIMEE\",AN143,DISTANCE5Q((AG143+AK143)/(AH143+AL143),distance)),AI143)","v":"NC"},null,"NC",null,{"$f":"IF(AH143=\"\",AG143,DISTANCE5Q(AG143/AH143,distance))","v":"NC"},0,0,0,"",{"$f":"IFERROR(DISTANCE5Q(AM143,distance),\"\")","v":""}]
[null,"-",{"$f":"IFERROR(IF(MATCH(Moyennes!B144,'nouveaux joueurs'!B:B,0) >1,\"nouveau joueur\",\"\"),\"\")","v":""},"NC",{"$f":"IFERROR(DISTANCELIBRE(D144,table),\"\")","v":""},null,null,"NC",0,0,0,"","NC",{"$f":"IFERROR(DISTANCEBANDE(M144,distance),\"\")","v":""},null,null,"NC",0,0,0,"","",{"$f":"IFERROR(DISTANCE3BANDES(V144,distance),\"\")","v":""},null,null,"NC",0,0,0,"",{"$f":"IF(AJ144>0,IF(AF144=\"ESTIMEE\",AN144,DISTANCE5Q((AG144+AK144)/(AH144+AL144),distance)),AI144)","v":"NC"},null,"NC",null,{"$f":"IF(AH144=\"\",AG144,DISTANCE5Q(AG144/AH144,distance))","v":"NC"},0,0,0,"",{"$f":"IFERROR(DISTANCE5Q(AM144,distance),\"\")","v":""}]
[]
["les joueurs en jaunes participent au tournoi cette année"]
["les joueurs en rouges ne participent pas au tournoi cette année "]
["LNR : licence non renouvelée"]
[]
["Source prise en compte pour la moyenne initial"]
["OFFICIELLE","Moyenne offcielle début de saison"]
["ESTIMEE","Estimation par le capitaine de l'équipe ou pour les 5 quilles, distance calculée à partir d'un autre mode de jeux"]
["-"]

{"sheet":"Distances","index":6,"n_rows":120,"n_cols":18,"rows_kept":120,"cut":false,"hidden":false,"merged":[[0,0,0,13]]}
["Distances vétérans 2024-2025"]
[]
["Les nombres en rouge correspondent au milieu de chaque catégorie"]
[null,"Libre",null,null,null,null,"Bande",null,null,null,null,"3 Bandes",null,null,null,"5 quilles"]
[]
[null,{"$f":"CONCATENATE(\"d= \",distance_libre_c,\" m² +\",distance_libre_b,\" m +\",distance_libre_a)","v":"d= -1,34 m² +30 m +22"},null,null,null,null,{"$f":"CONCATENATE(\"d= \",distance_bande_c,\" m² +\",distance_bande_b,\" m +\",distance_bande_a)","v":"d= -0,84 m² +21 m +23"},null,null,null,null,{"$f":"CONCATENATE(\"d= \",distance_3bandes_c,\" m² +\",distance_3bandes_b,\" m +\",distance_3bandes_a)","v":"d= 30 m² +23 m +8"},null,null,null,{"$f":"CONCATENATE(\"d= \",distance_quilles_c,\" m² +\",distance_quilles_b,\" m +\",distance_quilles_a)","v":"d= -2 m² +50 m +30"}]
[null,null,"incrément",{"$f":"(distance_quilles_max-distance_quilles_min)/(MAX(B$9:B$120)-MIN(B$9:B$120))","v":4.5045045045045047},null,null,null,"incrément",{"$f":"(distance_quilles_max-distance_quilles_min)/(MAX(G$9:G$120)-MIN(G$9:G$120))","v":19.23076923076923},null,null,null,"incrément",{"$f":"(distance_quilles_max-distance_quilles_min)/(MAX(L$9:L$120)-MIN(L$9:L$120))","v":71.839080459770116}]
["Cat.","m","distance","dist. 5Q",null,"Cat.","m","distance","dist. 5Q",null,"Cat.","m","distance","dist. 5Q",null,"Cat.","m","distance"]
[null,0,{"$f":"ROUND(distance_libre_c*B9^2+distance_libre_b*B9+distance_libre_a,0)","v":22},{"$f":"ROUND(distance_quilles_min+$D$7*B9,0)","v":60},null,null,0,{"$f":"ROUND(distance_bande_c*G9^2+distance_bande_b*G9+distance_bande_a,0)","v":23},{"$f":"ROUND(distance_quilles_min+$I$7*G9,0)","v":60},null,null,0,{"$f":"ROUND(distance_3bandes_c*L9^2+distance_3bandes_b*L9+distance_3bandes_a,0)","v":8},{"$f":"ROUND(distance_quilles_min+$N$7*L9,0)","v":60},null,null,0,{"$f":"IFERROR(ROUND(MAX(distance_quilles_min,MIN(distance_quilles_max,distance_quilles_a+Q9*distance_quilles_b+distance_quilles_c*Q9^2)),0),\"\")","v":60}]
[null,0.1,25,60,null,null,0.05,24,61,null,null,0.01,8,61,null,null,0.05,60]
[null,0.2,28,61,null,null,0.1,25,62,null,null,0.02,8,61,null,null,0.1,60]
[null,0.3,31,61,null,null,0.15,26,63,null,null,0.03,9,62,null,null,0.15,60]
[null,0.4,34,62,null,null,0.2,27,64,null,null,0.04,9,63,null,null,0.2,60]
[null,0.5,37,62,null,null,0.25,28,65,null,null,0.05,9,64,null,null,0.25,60]
["R4",0.6,40,63,null,null,0.3,29,66,null,null,0.06,9,64,null,null,0.3,60]
[null,0.7,42,63,null,null,0.35,30,67,null,null,7.0000000000000007E-2,10,65,null,null,0.35,60]
[null,0.8,45,64,null,null,0.4,31,68,null,null,0.08,10,66,null,null,0.4,60]
[null,0.9,48,64,null,null,0.45,32,69,null,null,0.09,10,66,null,null,0.45,60]
[null,1,51,65,null,"R2",0.5,33,70,null,null,0.1,11,67,null,null,0.5,60]
[null,1.1000000000000001,53,65,null,null,0.55000000000000004,34,71,null,null,0.11,11,68,null,null,0.55000000000000004,60]
[null,1.2,56,65,null,null,0.6,35,72,null,null,0.12,11,69,null,null,0.6,60]
[null,1.3,59,66,null,null,0.65,36,73,null,"R2",0.13,11,69,null,null,0.65,62]
[null,1.4,61,66,null,null,0.7,37,73,null,null,0.14000000000000001,12,70,null,null,0.7,64]
[null,1.5,64,67,null,null,0.75,38,74,null,null,0.15,12,71,null,null,0.75,66]
[null,1.6,67,67,null,null,0.8,39,75,null,null,0.16,12,71,null,null,0.8,69]
[null,1.7,69,68,null,null,0.85,40,76,null,null,0.17,13,72,null,null,0.85,71]
["R3",1.8,72,68,null,null,0.9,41,77,null,null,0.18,13,73,null,null,0.9,73]
[null,1.9,74,69,null,null,0.95,42,78,null,null,0.19,13,74,null,null,0.95,76]
[null,2,77,69,null,null,1,43,79,null,null,0.2,14,74,null,null,1,78]
[null,2.1,79,69,null,null,1.05,44,80,null,null,0.21,14,75,null,null,1.05,80]
[null,2.2000000000000002,82,70,null,null,1.1000000000000001,45,81,null,null,0.22,15,76,null,null,1.1000000000000001,83]
[null,2.2999999999999998,84,70,null,null,1.1499999999999999,46,82,null,null,0.23,15,77,null,null,1.1499999999999999,85]
[null,2.4,86,71,null,null,1.2,47,83,null,null,0.24,15,77,null,null,1.2,87]
[null,2.5,89,71,null,null,1.25,48,84,null,null,0.25,16,78,null,null,1.25,89]
[null,2.6,91,72,null,null,1.3,49,85,null,null,0.26,16,79,null,null,1.3,92]
[null,2.7,93,72,null,null,1.35,50,86,null,null,0.27,16,79,null,null,1.35,94]
[null,2.8,95,73,null,"R1",1.4,51,87,null,null,0.28000000000000003,17,80,null,null,1.4,96]
[null,2.9,98,73,null,null,1.45,52,88,null,null,0.28999999999999998,17,81,null,null,1.45,98]
["R2",3,100,74,null,null,1.5,53,89,null,null,0.3,18,82,null,null,1.5,101]
[null,3.1,102,74,null,null,1.55,54,90,null,"R1",0.31,18,82,null,null,1.55,103]
[null,3.2,{"$f":"ROUND(distance_libre_c*B41^2+distance_libre_b*B41+distance_libre_a,0)","v":104},{"$f":"ROUND(distance_quilles_min+$D$7*B41,0)","v":74},null,null,1.6,{"$f":"ROUND(distance_bande_c*G41^2+distance_bande_b*G41+distance_bande_a,0)","v":54},{"$f":"ROUND(distance_quilles_min+$I$7*G41,0)","v":91},null,null,0.32,{"$f":"ROUND(distance_3bandes_c*L41^2+distance_3bandes_b*L41+distance_3bandes_a,0)","v":18},{"$f":"ROUND(distance_quilles_min+$N$7*L41,0)","v":83},null,null,1.6,105]
[null,3.3,106,75,null,null,1.65,55,92,null,null,0.33,19,84,null,null,1.65,107]
[null,3.4,109,75,null,null,1.7,56,93,null,null,0.34,19,84,null,null,1.7,109]
[null,3.5,111,76,null,null,1.75,57,94,null,null,0.35,20,85,null,null,1.75,110]
[null,3.6,113,76,null,null,1.8,58,95,null,null,0.36,20,86,null,null,1.8,110]
[null,3.7,115,77,null,null,1.85,59,96,null,null,0.37,21,87,null,null,1.85,110]
[null,3.8,117,77,null,null,1.9,60,97,null,null,0.38,21,87,null,null,1.9,110]
[null,3.9,119,78,null,null,1.95,61,98,null,null,0.39,22,88,null,null,1.95,110]
[null,4,121,78,null,null,2,62,98,null,null,0.4,22,89,null,null,2,110]
[null,4.0999999999999996,122,78,null,null,2.0499999999999998,63,99,null,null,0.41,22,89]
[null,4.2,124,79,null,null,2.1,63,100,null,null,0.42,23,90]
[null,4.3,126,79,null,"N3",2.15,64,101,null,null,0.43,23,91]
[null,4.4000000000000004,128,80,null,null,2.2000000000000002,65,102,null,"N3",0.44,24,92]
[null,4.5,130,80,null,null,2.25,66,103,null,null,0.45,24,92]
[null,4.5999999999999996,132,81,null,null,2.2999999999999998,67,104,null,null,0.46,25,93]
[null,4.7,133,81,null,null,2.35,68,105,null,null,0.47,25,94]
[null,4.8,135,82,null,null,2.4,69,106,null,null,0.48,26,94]
[null,4.9000000000000004,137,82,null,null,2.4500000000000002,69,107,null,null,0.49,26,95]
["R1",5,139,83,null,null,2.5,70,108,null,null,0.5,27,96]
[null,5.0999999999999996,140,83,null,null,2.5499999999999998,71,109,null,null,0.51,28,97]
[null,5.2,142,83,null,null,2.6,72,110,null,null,0.52,28,97]
[null,5.3,143,84,null,null,null,null,null,null,null,0.53,29,98]
[null,5.4,145,84,null,null,null,null,null,null,null,0.54,29,99]
[null,5.5,146,85,null,null,null,null,null,null,null,0.55000000000000004,30,100]
[null,5.6,148,85,null,null,null,null,null,null,null,0.56000000000000005,30,100]
[null,5.7,149,86,null,null,null,null,null,null,null,0.56999999999999995,31,101]
[null,5.8,151,86,null,null,null,null,null,null,null,0.57999999999999996,31,102]
[null,5.9,152,87,null,null,null,null,null,null,null,0.59,32,102]
[null,6,154,87,null,null,null,null,null,null,"N2",0.6,33,103]
[null,6.1,155,87,null,null,null,null,null,null,null,0.61,33,104]
[null,6.2,156,88,null,null,null,null,null,null,null,0.62,34,105]
[null,6.3,158,88,null,null,null,null,null,null,null,0.63,34,105]
[null,6.4,{"$f":"ROUND(distance_libre_c*B73^2+distance_libre_b*B73+distance_libre_a,0)","v":159},{"$f":"ROUND(distance_quilles_min+$D$7*B73,0)","v":89},null,null,null,null,null,null,null,0.64,{"$f":"ROUND(distance_3bandes_c*L73^2+distance_3bandes_b*L73+distance_3bandes_a,0)","v":35},{"$f":"ROUND(distance_quilles_min+$N$7*L73,0)","v":106}]
[null,6.5,160,89,null,null,null,null,null,null,null,0.65,36,107]
[null,6.6,162,90,null,null,null,null,null,null,null,0.66,36,107]
[null,6.7,163,90,null,null,null,null,null,null,null,0.67,37,108]
[null,6.8,164,91,null,null,null,null,null,null,null,0.68,38,109]
[null,6.9,165,91,null,null,null,null,null,null,null,0.69,38,110]
["N3",7,166,92,null,null,null,null,null,null,null,0.69599999999999995,39,110]
[null,7.1,167,92]
[null,7.2,169,92]
[null,7.3,170,93]
[null,7.4,171,93]
[null,7.5,172,94]
[null,7.6,173,94]
[null,7.7,174,95]
[null,7.8,174,95]
[null,7.9,175,96]
[null,8,176,96]
[null,8.1,177,96]
[null,8.1999999999999993,178,97]
[null,8.3000000000000007,179,97]
[null,8.4,179,98]
[null,8.5,180,98]
[null,8.6,181,99]
[null,8.6999999999999993,182,99]
[null,8.8000000000000007,182,100]
[null,8.9,183,100]
[null,9,183,101]
[null,9.1,184,101]
[null,9.1999999999999993,185,101]
[null,9.3000000000000007,185,102]
[null,9.4,186,102]
["N3",9.5,186,103]
[null,9.6,{"$f":"ROUND(distance_libre_c*B105^2+distance_libre_b*B105+distance_libre_a,0)","v":187},{"$f":"ROUND(distance_quilles_min+$D$7*B105,0)","v":103}]
[null,9.6999999999999993,187,104]
[null,9.8000000000000007,187,104]
[null,9.9,188,105]
[null,10,188,105]
[null,10.1,188,105]
[null,10.199999999999999,189,106]
[null,10.3,189,106]
[null,10.4,189,107]
[null,10.5,189,107]
[null,10.6,189,108]
[null,10.7,190,108]
[null,10.8,190,109]
[null,10.9,190,109]
[null,11,190,110]
[null,11.1,190,110]

{"sheet":"Equipes","index":7,"n_rows":131,"n_cols":14,"rows_kept":131,"cut":false,"hidden":false,"merged":[[17,13,17,19],[90,7,90,8],[113,10,113,11],[90,4,90,5],[61,1,61,2],[74,4,74,5],[76,1,76,2],[90,1,90,2],[74,1,74,2],[88,1,88,2],[113,4,113,5],[0,13,0,19],[59,1,59,2],[39,13,39,19],[0,0,0,11],[4,1,4,2],[18,13,18,19],[4,4,4,5],[25,7,25,8],[27,1,27,2],[25,1,25,2],[59,4,59,5],[25,4,25,5],[4,13,4,19],[36,1,36,2],[38,1,38,2],[3,12,3,16],[126,10,126,11],[130,1,130,2],[111,1,111,2],[126,1,126,2],[111,4,111,5],[111,7,111,8],[113,1,113,2],[128,1,128,2],[126,4,126,5]]}
["Liste des équipes engagées pour la saison 2025 / 2026",null,null,null,null,null,null,null,null,null,null,null,null,"Suivi des équipes incomplètes"]
[]
[null,"Equipe 1",null,null,"Equipe 2",null,null,"Equipe 3",null,null,"Remplaçants "]
[null,null,null,null,null,null,null,null,null,null,"(sera affecté à l'équipe pour laquelle il aura fait le premier match)",null,"Une équipe qui ne peut présenter que 3 joueurs est dite incomplète. Ce cas de figure ne sera accepté que 2 fois dans la saison, à la 3ème fois, cette équipe sera déclarée forfait et les points seront alors comptabilisés comme défini au paragraphe 7 du règlement."]
[null,"Equipe 1",null,null,null,null,null,null,null,null,null,null,null,"Matchs Aller équipes incomplètes"]
["Arpajon ",null,null,null,null,null,null,null,null,null,null,null,null,1]
[9095,"Jean Claude DEVILLEBICHOT","104112 I",null,null,null,null,null,null,null,null,null,null,2]
[null,"Daniel GODFIN","179222 G",null,null,null,null,null,null,null,"Daniel GODFIN","179222 G",null,3]
[null,"Philippe VIGNON","172084 Y",null,null,null,null,null,null,null,"Pascal JACQUIN","127813 x",null,4]
[null,"Max THENOT","154289 F",null,null,null,null,null,null,null,"Manuel Pinto MONTERO","184622 B",null,5]
[null,"Dominique CUILLERAT","187715 N",null,null,null,null,null,null,null,"Max THENOT","154289 F",null,6]
[null,"Manuel Pinto MONTERO","184622 B",null,null,null,null,null,null,null,"Christophe GESLIN","154485 T",null,7]
[null,"Pascal JACQUIN","127813 x",null,null,null,null,null,null,null,"Philippe VIGNON","172084 Y",null,8]
[null,"Christophe GESLIN","154485 T",null,null,null,null,null,null,null,"Jacques LORENZI","183003 R",null,9]
[null,"Pascal JACQUIN","127813 x",null,null,null,null,null,null,null,"Tan Phuong NGUYEN","178279 G",null,10]
[null,null,null,null,null,null,null,null,null,null,"Dominique CUILLERAT","187715 N"]
[null,null,null,null,null,null,null,null,null,null,"Jean Claude DEVILLEBICHOT","104112 I"]
[]
[null,null,null,null,null,null,null,null,null,null,null,null,null,"Matchs Retour équipes incomplètes"]
[null,null,null,null,null,null,null,null,null,null,null,null,null,1]
[null,null,null,null,null,null,null,null,null,null,null,null,null,2]
[null,null,null,null,null,null,null,null,null,null,null,null,null,3]
[null,null,null,null,null,null,null,null,null,null,null,null,null,4]
[null,null,null,null,null,null,null,null,null,null,null,null,null,5]
[null,null,null,null,null,null,null,null,null,null,null,null,null,6]
[null,null,null,null,null,null,null,null,null,null,null,null,null,7]
[null,null,null,null,null,null,null,null,null,null,null,null,null,8]
[null,"Equipe 1",null,null,null,null,null,null,null,null,null,null,null,9]
[null,null,null,null,null,null,null,null,null,null,null,null,null,10]
[]
[]
[]
[]
[]
[]
[]
[]
[]
[null,"Equipe 1"]
["Draveil","Jean Louis HUE","188935 P",null,null,null,null,null,null,null,"Germain DESHAYES","149927 P",null,"     Année 2025 / 2026 : 76 participants - 11 nouveaux joueurs"]
[9082,"Didier MOULAY","013796 Q",null,null,null,null,null,null,null,"Philippe LEVOIVENEL","140579 X"]
[null,"Eric TAVERNIER","171909 H",null,null,null,null,null,null,null,"Rolland HOUDOU","120412 G"]
[null,"Patrice MESNY","013731 D",null,null,null,null,null,null,null,"Christian AUBOUET","114584 C"]
[null,"Maurice MIRLAUD","013753 Z",null,null,null,null,null,null,null,"Maurice MIRLAUD","013753 Z"]
[null,"Eric ANNE","142400 Y",null,null,null,null,null,null,null,"Marcel LAUTI","109482 W"]
[null,"Jean Paul DELOBEL","166094 M",null,null,null,null,null,null,null,"Didier MOULAY","013796 Q"]
[null,"Germain DESHAYES","149927 P",null,null,null,null,null,null,null,"Jean Louis HUE","188935 P"]
[null,null,null,null,null,null,null,null,null,null,"Roberto LAMPLE","114622 O"]
[null,null,null,null,null,null,null,null,null,null,"Bernard VIVENOT","132296 I"]
[null,null,null,null,null,null,null,null,null,null,"Eric ANNE","142400 Y"]
[null,null,null,null,null,null,null,null,null,null,"Guy HUIBAN","139193 P"]
[null,null,null,null,null,null,null,null,null,null,"Patrice MESNY","013731 D"]
[null,null,null,null,null,null,null,null,null,null,"Eric TAVERNIER","171909 H"]
[null,null,null,null,null,null,null,null,null,null,"Jean Paul DELOBEL","166094 M"]
[null,null,null,null,null,null,null,null,null,null,"Joseph MARTINEZ","103337 N"]
[null,null,null,null,null,null,null,null,null,null,"Jean LESAGE","138060 A"]
[]
[]
[]
[]
[]
[null,"Equipe 1"]
[null,"LEBROT Guy","138066 G",null,null,null,null,null,null,null,"FLEURY Gérard","153995 L"]
["Etréchy","HOUPLAIN Michel","013365 B",null,null,null,null,null,null,null,"BELINGARD Eric","138061 B"]
[9096,"VERLEY Nicolas","018351 V",null,null,null,null,null,null,null,"PORCU Frédéric","133357 D"]
[null,"LHOMME Eric","181958 F",null,null,null,null,null,null,null,"LHOMME Eric","181958 F"]
[null,"FLEURY Gérard","153995 L",null,null,null,null,null,null,null,"LEBROT Guy","138066 G"]
[null,"BENOIT Patrick","185784 P",null,null,null,null,null,null,null,"SAULE Philippe","182187 E"]
[null,"LOUBIGNAC Jean Claude","174503 C",null,null,null,null,null,null,null,"HOUPLAIN Michel","013365 B"]
[null,"PORCU Frédéric","133357 D",null,null,null,null,null,null,null,"LOUBIGNAC Jean Claude","174503 C"]
[null,null,null,null,null,null,null,null,null,null,"BRILLAUD Patrick","169399 E"]
[null,null,null,null,null,null,null,null,null,null,"VERLEY Nicolas","018351 V"]
[null,null,null,null,null,null,null,null,null,null,"BENOIT Patrick","185784 P"]
[]
[]
[]
[null,"Equipe 1"]
[null,"Bernard BRIOIT","156244 F"]
["Massy","Philippe VANHEE","182749 Q",null,null,null,null,null,null,null,"Bernard BRIOIT","156244 F"]
[9064,"Maurice CARON","126098 Y",null,null,null,null,null,null,null,"Jean-Paul CARLE","152435 Q"]
[null,"Jean-Paul CARLE","152435 Q",null,null,null,null,null,null,null,"Christian DANIAU","148183 T"]
[null,"Thierry LEVANIER","191125 v",null,null,null,null,null,null,null,"Patrick JOYEZ","013415 Z"]
[null,"Christian DANIAU","148183 T",null,null,null,null,null,null,null,"Thierry LEVANIER","191125 v"]
[null,null,null,null,null,null,null,null,null,null,"Philippe VANHEE","182749 Q"]
[null,null,null,null,null,null,null,null,null,null,"Maurice CARON","126098 Y"]
[null,null,null,null,null,null,null,null,null,null,"Stéphane AGUEFF","191524 D"]
[]
[]
[]
[]
[null,"Equipe 1",null,null,"Equipe 2",null,null,"Equipe 3"]
[null,"Marc VICARI","014321 V",null,"Martial PREVOT","165700 J",null,null,null,null,"Manuel PAIS","169180 R"]
["Morangis","Hervé MAILLARD","186955 M",null,"Eric VINGUEASSALOM","014337 L",null,null,null,null,"Bernard FAYT","165924 C"]
[9009,"Manuel PAIS","169180 R",null,"Jean Pierre CHAMPAGNE","124892 O",null,null,null,null,"Jean Claude FREYSZ","139536 U"]
[null,"Araya LILLO","163145 G",null,"Alain GOT","148370 X",null,null,null,null,"Stéphane MIRMAN","125422 Y"]
[null,"Roland COTILLARD","1080203B",null,"Jean Michel AIRAULT","012403 B",null,null,null,null,"Gérald TRUFFAUT","134307 R"]
[null,"Bernard FAYT","165924 C",null,"François VILLET","184194 L",null,null,null,null,"Jacques PRIEUR","133738 U"]
[null,"Michel ALEXANDRE","120146 A",null,"Stéphane MIRMAN","125422 Y",null,null,null,null,"Alain GOT","148370 X"]
[null,null,null,null,"Gérald TRUFFAUT","134307 R",null,null,null,null,"François VILLET","184194 L"]
[null,null,null,null,null,null,null,null,null,null,"Martial PREVOT","165700 J"]
[null,null,null,null,null,null,null,null,null,null,"Michel ALEXANDRE","120146 A"]
[null,null,null,null,null,null,null,null,null,null,"Araya LILLO","163145 G"]
[null,null,null,null,null,null,null,null,null,null,"Thierry VALLEE","165702 L"]
[null,null,null,null,null,null,null,null,null,null,"Eric VINGUEASSALOM","014337 L"]
[null,null,null,null,null,null,null,null,null,null,"Marc VICARI","014321 V"]
[null,null,null,null,null,null,null,null,null,null,"Jean Pierre CHAMPAGNE","124892 O"]
[null,null,null,null,null,null,null,null,null,null,"Roland COTILLARD","1080203B"]
[null,null,null,null,null,null,null,null,null,null,"Hervé MAILLARD","186955 M"]
[null,null,null,null,null,null,null,null,null,null,"Jean Michel AIRAULT","012403 B"]
[]
[]
[]
[]
[null,"Equipe 1",null,null,"Equipe 2",null,null,null,null,null,"Equipe 1"]
[null,"JOREAU Danièle","114621 N",null,"ROUX Olivier","185900 Q",null,null,null,null,"ABITBOL Mickaël","185993 R"]
["Vigneux","COSOLETO Carmelo","012847 D",null,"MICHELET Jean Claude","135964 K",null,null,null,null,"ANNERON Alain","150615 M"]
[9131,"BORDIER Marc","012634 Y",null,"MOINDREAU Michel","150618 Q",null,null,null,null,"BIDE Roger","012582 Y"]
[null,"ABITBOL Mickaël","185993 R",null,"CATALLO Fausto","185992 Q",null,null,null,null,"BORDIER Marc","012634 Y"]
[null,"HELEU Jérome","166095 N",null,"VENOT René","186705 Q",null,null,null,null,"CATALLO Fausto","185992 Q"]
[null,"BIDE Roger","012582 Y",null,"ANNERON Alain","150615 M",null,null,null,null,"VENOT René","186705 Q"]
[null,null,null,null,null,null,null,null,null,null,"HELEU Jérome","166095 N"]
[null,null,null,null,null,null,null,null,null,null,"MICHELET Jean Claude","135964 K"]
[null,null,null,null,null,null,null,null,null,null,"ROUX Olivier","185900 Q"]
[null,null,null,null,null,null,null,null,null,null,"JOREAU Danièle","114621 N"]
[null,null,null,null,null,null,null,null,null,null,"COSOLETO Carmelo","012847 D"]
[null,null,null,null,null,null,null,null,null,null,"MOINDREAU Michel","150618 Q"]
[]
[]
[null,"Inscrits saison 2025 / 2026"]
[]
[null," participants 60"]

{"sheet":"Gestion","index":8,"n_rows":40,"n_cols":9,"rows_kept":40,"cut":false,"hidden":true,"merged":[]}
["Calendrier",null,"Liste des clubs à établir en début de saison :"]
["2025-11-18",null,"ARPAJON"]
["2025-11-25",null,"DRAVEIL",null,"INTEGRATION DU RESULTAT : !!! Pensez à COPIER LE RESULTAT à partir de l'onglet FEUILLE DE MATCH "]
["2025-12-02",null,"ETRECHY"]
["2025-12-09",null,"MASSY",null,"Nombre"]
["2025-12-16",null,"MORANGIS1",null,"Type","Total",null,"Dernière journée",{"$f":"MAX(Matchs!A:A)","v":7}]
["2026-01-06",null,"MORANGIS2",null,"Rencontre",27]
["2026-01-13",null,"VIGNEUX1"]
["2026-01-20",null,"VIGNEUX2"]
["2026-01-27",null,"-",null,"Début de saison : Remise à zéro de tous les  matchs , classement vide et 1er journée"]
["2026-02-03",null,"-"]
["2026-02-10",null,"-"]
["2026-02-17",null,"-"]
["2026-03-10",null,"-"]
["2026-03-17",null,"-",null,"Actualisation de classement (à faire après modification de l'onglet matchs)"]
["2026-03-24",null,"-"]
["2026-03-31",null,"-"]
["2026-04-07",null,"-"]
["2026-04-14",null,"-"]
["2026-05-05",null,"-"]
["2026-05-12",null,"-"]
["-",null,"-"]
["-",null,"-"]
["-",null,"-"]
["-",null,"-"]
["-",null,"-"]
[]
[]
[]
[]
["Formule de calcul des distances en fonction des moyennes"]
["Calcul distance",null,"d = a + bm + cm²"]
[null,"mode de jeux :","a","b","c"]
[null,"libre",22,30,-1.34]
[null,"bande ",23,21,-0.84]
[null,"3 bandes",8,23,30,"min","max"]
[null,"quille",30,50,-2,60,110]
[]
["m : moyenne générale ou pour les quilles = points marqués / points subis"]
["dist : distance du joueur"]

{"sheet":"nouveaux joueurs","index":9,"n_rows":13,"n_cols":2,"rows_kept":13,"cut":false,"hidden":true,"merged":[[0,0,0,1]]}
["Nouveaux joueurs"]
[]
["ETR","BENOIT"]
["VIG","VENOT"]
["ETR","SAULE"]
["ETR","LEBROT"]
["DRA","HOUDOU"]
["DRA","HUE"]
["ARP","LORENZI"]
["ARP","NGUYEN"]
["ARP","CUILLERAT"]
["VIG","COSOLETO"]
["MAS","AGUEFF"]

{"sheet":"Gestion matchs","index":10,"n_rows":43,"n_cols":16,"rows_kept":43,"cut":false,"hidden":true,"merged":[[8,2,8,6],[31,1,31,7]]}
[null,"Modification d'une partie existante:"]
[null,"1) compléter le n° de journée et le nom des deux équipes"]
[null,"2) charger le résultat"]
[null,"3) modifier le résultat"]
[null,"4) enregistrer les modifications"]
[]
[]
[null,"Numéro journée :","EQUIPE RECEVANTE :",null,null,null,null,null,null,"EQUIPE VISITEUSE :"]
[null,1,"DRAVEIL",null,null,null,null,null,null,"ARPAJON"]
[]
[null,null,null,null,null,null,null,null,null,null,6]
[null,"Résultat de la journée :",null,null,null,null,null,null,null,null,6]
[null,"NOM DES JOUEURS",null,null,null,null,null,null,null,"NOM DES JOUEURS"]
[]
[null,"Libre","distance","pts réal.","reprises","moyenne",null,"pt match",null,"Libre","distance","pts réal.","reprises","moyenne",null,"pt match"]
[null,"LAMPLE",85,85,27,{"$f":"IF(E16=\"\",\"\",D16/E16)","v":3.1481481481481484},null,{"$f":"IF(D16=0,\"\",IF(C16=D16,IF(K16=L16,2,3),IF(D16<C16,1)))","v":3},null,"CUILLERAT",40,32,27,{"$f":"IF(M16=\"\",\"\",L16/M16)","v":1.1851851851851851},null,{"$f":"IF(L16=0,\"\",IF(K16=L16,IF(D16=C16,2,3),IF(L16<K16,1)))","v":1}]
[]
[null,null,null,null,null,"moyenne",null,"pts match",null,null,null,null,null,"moyenne",null,"pts match"]
[null,"TAVERNIER",46,38,59,{"$f":"IF(E19=\"\",\"\",D19/E19)","v":0.64406779661016944},null,{"$f":"IF(D19=0,\"\",IF(C19=D19,IF(K19=L19,2,3),IF(D19<C19,1)))","v":1},null,"GODFIN",36,36,59,{"$f":"IF(M19=\"\",\"\",L19/M19)","v":0.61016949152542377},null,{"$f":"IF(L19=0,\"\",IF(K19=L19,IF(D19=C19,2,3),IF(L19<K19,1)))","v":3}]
[]
[null,null,null,null,null,"moyenne",null,"pts match",null,null,null,null,null,"moyenne",null,"pts match"]
[null,"MOULAY",25,23,44,{"$f":"IF(E22=\"\",\"\",D22/E22)","v":0.52272727272727271},null,{"$f":"IF(D22=0,\"\",IF(C22=D22,IF(K22=L22,2,3),IF(D22<C22,1)))","v":1},null,"DEVILLEBICHOT",22,22,44,{"$f":"IF(M22=\"\",\"\",L22/M22)","v":0.5},null,{"$f":"IF(L22=0,\"\",IF(K22=L22,IF(D22=C22,2,3),IF(L22<K22,1)))","v":3}]
[]
[]
[null,"DESHAYES",68,54,50,{"$f":"IF(D25=C25,1,0)","v":0},{"$f":"IF(E25=C25,1,0)","v":0},{"$f":"IF(D25=0,\"\",IF(F25+G25=2,3,IF(F25+G25=1,2,1)))","v":1},null,"GESLIN",60,60,60,{"$f":"IF(L25=K25,1,0)","v":1},{"$f":"IF(M25=K25,1,0)","v":1},{"$f":"IF(L25=0,\"\",IF(N25+O25=2,3,IF(N25+O25=1,2,1)))","v":3}]
[]
[null,"TOTAUX",{"$f":"IF(C16+C19+C22+C25=0,\"\",SUM(C16+C19+C22+C25))","v":224},{"$f":"IF(D16+D19+D22+D25+E25=0,\"\",SUM(D16+D19+D22+D25))","v":200},"coef.\nPond.",{"$f":"IF(C27=\"\",\"\",(D16*1+D19*2+D22*5+(D25+E25)*0.5)/(C16*1+C19*2+C22*5+2*C25*0.5))","v":0.88648648648648654},null,null,null,"TOTAUX",{"$f":"IF(K16+K19+K22+K25=0,\"\",SUM(K16+K19+K22+K25))","v":158},{"$f":"IF(L16+L19+L22+L25+M25=0,\"\",SUM(L16+L19+L22+L25))","v":150},"coef.\nPond.",{"$f":"IF(K27=\"\",\"\",(L16*1+L19*2+L22*5+(L25+M25)*0.5)/(K16*1+K19*2+K22*5+2*K25*0.5))","v":0.97163120567375882}]
[]
[null,"points obtenus par l'équipe : >>>>>>>>>>>> >>>>>>>>>>>>>>>>>>>",null,null,null,null,null,{"$f":"IF(H16=\"\",\"\",H16+H19+H22+H25)","v":6},null,"points obtenus par l'équipe : >>>>>>>>>>>> >>>>>>>>>>>>>>>>>>>",null,null,null,null,null,{"$f":"IF(P16=\"\",\"\",P16+P19+P22+P25)","v":10}]
[]
[]
[null,"!!! NE PAS MODIFIER !!!  Utiliser par la macro \"ENREGISTRER MODIFICATION'"]
[{"$f":"$B$9","v":1},"Rencontre",{"$f":"CONCATENATE(D33,\" - \",J33)","v":"DRAVEIL - ARPAJON"},{"$f":"$C$9","v":"DRAVEIL"},{"$f":"E36+2*E37+5*E38+E39+E39","v":438},{"$f":"F36+2*F37+5*F38+F39+G39","v":380},{"$f":"H36+H37+H38+H39","v":6},{"$f":"IF(G33>M33,3,IF(G33<M33,1,2))","v":1},null,{"$f":"$J$9","v":"ARPAJON"},{"$f":"K36+2*K37+5*K38+K39+K39","v":342},{"$f":"L36+2*L37+5*L38+L39+M39","v":334},{"$f":"N36+N37+N38+N39","v":10},{"$f":"IF(M33>G33,3,IF(M33<G33,1,2))","v":3}]
[{"$f":"$B$9","v":1},"Points equipes",{"$f":"$D$33","v":"DRAVEIL"},null,{"$f":"E33","v":438},{"$f":"F33","v":380},{"$f":"G33","v":6},{"$f":"H33","v":1},{"$f":"$J$33","v":"ARPAJON"},null,{"$f":"K33","v":342},{"$f":"L33","v":334},{"$f":"M33","v":10},{"$f":"N33","v":3}]
[1,"Points equipes",{"$f":"$J$33","v":"ARPAJON"},null,{"$f":"K33","v":342},{"$f":"L33","v":334},{"$f":"M33","v":10},{"$f":"N33","v":3},{"$f":"$D$33","v":"DRAVEIL"},null,{"$f":"E33","v":438},{"$f":"F33","v":380},{"$f":"G33","v":6},{"$f":"H33","v":1}]
[1,{"$f":"'Feuille-match'!$B$12","v":"Libre"},{"$f":"$D$33","v":"DRAVEIL"},{"$f":"B16","v":"LAMPLE"},{"$f":"C16","v":85},85,27,{"$f":"H16","v":3},{"$f":"$J$33","v":"ARPAJON"},{"$f":"J16","v":"CUILLERAT"},{"$f":"K16","v":40},32,{"$f":"M16","v":27},{"$f":"P16","v":1}]
[1,{"$f":"'Feuille-match'!$B$15","v":"Bande"},{"$f":"$D$33","v":"DRAVEIL"},{"$f":"B19","v":"TAVERNIER"},{"$f":"C19","v":46},38,59,{"$f":"H19","v":1},{"$f":"$J$33","v":"ARPAJON"},{"$f":"J19","v":"GODFIN"},{"$f":"K19","v":36},36,{"$f":"M19","v":59},{"$f":"P19","v":3}]
[1,{"$f":"'Feuille-match'!$B$18","v":"3 Bandes"},{"$f":"$D$33","v":"DRAVEIL"},{"$f":"B22","v":"MOULAY"},{"$f":"C22","v":25},23,44,{"$f":"H22","v":1},{"$f":"$J$33","v":"ARPAJON"},{"$f":"J22","v":"DEVILLEBICHOT"},{"$f":"K22","v":22},22,{"$f":"M22","v":44},{"$f":"P22","v":3}]
[1,{"$f":"'Feuille-match'!$B$21","v":"5 Quilles"},{"$f":"$D$33","v":"DRAVEIL"},{"$f":"B25","v":"DESHAYES"},{"$f":"C25","v":68},54,50,{"$f":"H25","v":1},{"$f":"$J$33","v":"ARPAJON"},{"$f":"J25","v":"GESLIN"},{"$f":"K25","v":60},60,{"$f":"M25","v":60},{"$f":"P25","v":3}]
[1,{"$f":"'Feuille-match'!$B$12","v":"Libre"},{"$f":"$J$33","v":"ARPAJON"},{"$f":"J36","v":"CUILLERAT"},40,32,27,1,{"$f":"C36","v":"DRAVEIL"},"LAMPLE",85,85,27,3]
[1,{"$f":"'Feuille-match'!$B$15","v":"Bande"},{"$f":"$J$33","v":"ARPAJON"},"GODFIN",36,36,59,3,"DRAVEIL","TAVERNIER",46,38,59,1]
[1,{"$f":"'Feuille-match'!$B$18","v":"3 Bandes"},{"$f":"$J$33","v":"ARPAJON"},"DEVILLEBICHOT",22,22,44,3,"DRAVEIL","MOULAY",25,23,44,1]
[1,{"$f":"'Feuille-match'!$B$21","v":"5 Quilles"},{"$f":"$J$33","v":"ARPAJON"},"GESLIN",60,60,60,3,"DRAVEIL","DESHAYES",68,54,50,1]

{"sheet":"Matchs","index":11,"n_rows":325,"n_cols":14,"rows_kept":325,"cut":false,"hidden":true,"merged":[]}
["Journée","Type","Equipe","Joueur ","distance","point","reprise","pt match","Equipe adv","Adversaire","distance","point","reprise","pt match"]
["VETERANT"]
[1,"Rencontre","DRAVEIL - ARPAJON","DRAVEIL",438,380,6,1,null,"ARPAJON",342,334,10,3]
[1,"Points equipes","DRAVEIL",null,438,380,6,1,"ARPAJON",null,342,334,10,3]
[1,"Points equipes","ARPAJON",null,342,334,10,3,"DRAVEIL",null,438,380,6,1]
[1,"Libre","DRAVEIL","LAMPLE",85,85,27,3,"ARPAJON","CUILLERAT",40,32,27,1]
[1,"Bande","DRAVEIL","TAVERNIER",46,38,59,1,"ARPAJON","GODFIN",36,36,59,3]
[1,"3 Bandes","DRAVEIL","MOULAY",25,23,44,1,"ARPAJON","DEVILLEBICHOT",22,22,44,3]
[1,"5 Quilles","DRAVEIL","DESHAYES",68,54,50,1,"ARPAJON","GESLIN",60,60,60,3]
[1,"Libre","ARPAJON","CUILLERAT",40,32,27,1,"DRAVEIL","LAMPLE",85,85,27,3]
[1,"Bande","ARPAJON","GODFIN",36,36,59,3,"DRAVEIL","TAVERNIER",46,38,59,1]
[1,"3 Bandes","ARPAJON","DEVILLEBICHOT",22,22,44,3,"DRAVEIL","MOULAY",25,23,44,1]
[1,"5 Quilles","ARPAJON","GESLIN",60,60,60,3,"DRAVEIL","DESHAYES",68,54,50,1]
["VETERANT"]
[1,"Rencontre","ETRECHY - MASSY","ETRECHY",409,351,6,1,null,"MASSY",382,362,10,3]
[1,"Points equipes","ETRECHY",null,409,351,6,1,"MASSY",null,382,362,10,3]
[1,"Points equipes","MASSY",null,382,362,10,3,"ETRECHY",null,409,351,6,1]
[1,"Libre","ETRECHY","LOUBIGNAC",47,43,40,1,"MASSY","BRIOIT",69,69,40,3]
[1,"Bande","ETRECHY","HOUPLAIN",56,56,38,3,"MASSY","DANIAU",40,30,38,1]
[1,"3 Bandes","ETRECHY","VERLEY",24,18,49,1,"MASSY","CARON",21,21,49,3]
[1,"5 Quilles","ETRECHY","PORCU",65,43,63,1,"MASSY","CARLE",64,64,64,3]
[1,"Libre","MASSY","BRIOIT",69,69,40,3,"ETRECHY","LOUBIGNAC",47,43,40,1]
[1,"Bande","MASSY","DANIAU",40,30,38,1,"ETRECHY","HOUPLAIN",56,56,38,3]
[1,"3 Bandes","MASSY","CARON",21,21,49,3,"ETRECHY","VERLEY",24,18,49,1]
[1,"5 Quilles","MASSY","CARLE",64,64,64,3,"ETRECHY","PORCU",65,43,63,1]
["VETERANT"]
[1,"Rencontre","MORANGIS1 - MORANGIS2","MORANGIS1",499,466,7,1,null,"MORANGIS2",398,356,9,3]
[1,"Points equipes","MORANGIS1",null,499,466,7,1,"MORANGIS2",null,398,356,9,3]
[1,"Points equipes","MORANGIS2",null,398,356,9,3,"MORANGIS1",null,499,466,7,1]
[1,"Libre","MORANGIS1","VICARI",161,161,26,3,"MORANGIS2","VINGUEASSALOM",84,66,26,1]
[1,"Bande","MORANGIS1","FAYT",40,34,43,1,"MORANGIS2","VILLET",37,37,43,3]
[1,"3 Bandes","MORANGIS1","PAIS",24,22,51,1,"MORANGIS2","AIRAULT",24,24,51,3]
[1,"5 Quilles","MORANGIS1","LILLO",69,58,69,2,"MORANGIS2","GOT",60,60,36,2]
[1,"Libre","MORANGIS2","VINGUEASSALOM",84,66,26,1,"MORANGIS1","VICARI",161,161,26,3]
[1,"Bande","MORANGIS2","VILLET",37,37,43,3,"MORANGIS1","FAYT",40,34,43,1]
[1,"3 Bandes","MORANGIS2","AIRAULT",24,24,51,3,"MORANGIS1","PAIS",24,22,51,1]
[1,"5 Quilles","MORANGIS2","GOT",60,60,36,2,"MORANGIS1","LILLO",69,58,69,2]
["VETERANT"]
[1,"Rencontre","VIGNEUX1 - VIGNEUX2","VIGNEUX1",407,399,10,3,null,"VIGNEUX2",322,256,6,1]
[1,"Points equipes","VIGNEUX1",null,407,399,10,3,"VIGNEUX2",null,322,256,6,1]
[1,"Points equipes","VIGNEUX2",null,322,256,6,1,"VIGNEUX1",null,407,399,10,3]
[1,"Libre","VIGNEUX1","HELLEU",75,67,40,1,"VIGNEUX2","MICHELET",53,53,40,3]
[1,"Bande","VIGNEUX1","COSOLETO",43,43,48,3,"VIGNEUX2","MOINDREAU",37,30,48,1]
[1,"3 Bandes","VIGNEUX1","BORDIER",18,18,59,3,"VIGNEUX2","ROUX",13,9,59,1]
[1,"5 Quilles","VIGNEUX1","ABITBOL",78,78,78,3,"VIGNEUX2","VENOT",65,53,45,1]
[1,"Libre","VIGNEUX2","MICHELET",53,53,40,3,"VIGNEUX1","HELLEU",75,67,40,1]
[1,"Bande","VIGNEUX2","MOINDREAU",37,30,48,1,"VIGNEUX1","COSOLETO",43,43,48,3]
[1,"3 Bandes","VIGNEUX2","ROUX",13,9,59,1,"VIGNEUX1","BORDIER",18,18,59,3]
[1,"5 Quilles","VIGNEUX2","VENOT",65,53,45,1,"VIGNEUX1","ABITBOL",78,78,78,3]
["VETERANT"]
[2,"Rencontre","VIGNEUX2 - MORANGIS2","VIGNEUX2",314,265,7,1,null,"MORANGIS2",394,347,9,3]
[2,"Points equipes","VIGNEUX2",null,314,265,7,1,"MORANGIS2",null,394,347,9,3]
[2,"Points equipes","MORANGIS2",null,394,347,9,3,"VIGNEUX2",null,314,265,7,1]
[2,"Libre","VIGNEUX2","MICHELET",56,49,62,1,"MORANGIS2","VINGUEASSALOM",87,87,62,3]
[2,"Bande","VIGNEUX2","MOINDREAU",37,37,48,3,"MORANGIS2","VILLET",39,35,48,1]
[2,"3 Bandes","VIGNEUX2","ROUX",12,6,49,1,"MORANGIS2","CHAMPAGNE",19,19,49,3]
[2,"5 Quilles","VIGNEUX2","CATALLO",62,50,62,2,"MORANGIS2","GOT",67,67,28,2]
[2,"Libre","MORANGIS2","VINGUEASSALOM",87,87,62,3,"VIGNEUX2","MICHELET",56,49,62,1]
[2,"Bande","MORANGIS2","VILLET",39,35,48,1,"VIGNEUX2","MOINDREAU",37,37,48,3]
[2,"3 Bandes","MORANGIS2","CHAMPAGNE",19,19,49,3,"VIGNEUX2","ROUX",12,6,49,1]
[2,"5 Quilles","MORANGIS2","GOT",67,67,28,2,"VIGNEUX2","CATALLO",62,50,62,2]
["VETERANT"]
[2,"Rencontre","MASSY - VIGNEUX1","MASSY",432,350,8,2,null,"VIGNEUX1",476,435,8,2]
[2,"Points equipes","MASSY",null,432,350,8,2,"VIGNEUX1",null,476,435,8,2]
[2,"Points equipes","VIGNEUX1",null,476,435,8,2,"MASSY",null,432,350,8,2]
[2,"Libre","MASSY","BRIOIT",69,69,55,3,"VIGNEUX1","HELLEU",72,61,55,1]
[2,"Bande","MASSY","VANHEE",29,12,71,1,"VIGNEUX1","BIDE",47,47,71,3]
[2,"3 Bandes","MASSY","DANIAU",17,17,38,3,"VIGNEUX1","BORDIER",18,12,38,1]
[2,"5 Quilles","MASSY","CARLE",110,86,86,1,"VIGNEUX1","ABITBOL",110,110,110,3]
[2,"Libre","VIGNEUX1","HELLEU",72,61,55,1,"MASSY","BRIOIT",69,69,55,3]
[2,"Bande","VIGNEUX1","BIDE",47,47,71,3,"MASSY","VANHEE",29,12,71,1]
[2,"3 Bandes","VIGNEUX1","BORDIER",18,12,38,1,"MASSY","DANIAU",17,17,38,3]
[2,"5 Quilles","VIGNEUX1","ABITBOL",110,110,110,3,"MASSY","CARLE",110,86,86,1]
["VETERANT"]
[2,"Rencontre","ARPAJON - ETRECHY","ARPAJON",362,326,8,2,null,"ETRECHY",384,345,8,2]
[2,"Points equipes","ARPAJON",null,362,326,8,2,"ETRECHY",null,384,345,8,2]
[2,"Points equipes","ETRECHY",null,384,345,8,2,"ARPAJON",null,362,326,8,2]
[2,"Libre","ARPAJON","VIGNON",58,58,41,3,"ETRECHY","LOUBIGNAC",50,38,41,1]
[2,"Bande","ARPAJON","GESLIN",42,34,44,1,"ETRECHY","LHOMME",42,42,44,3]
[2,"3 Bandes","ARPAJON","PINTO",16,12,88,1,"ETRECHY","VERLEY",22,22,88,3]
[2,"5 Quilles","ARPAJON","THENOT",70,70,70,3,"ETRECHY","PORCU",70,64,49,1]
[2,"Libre","ETRECHY","LOUBIGNAC",50,38,41,1,"ARPAJON","VIGNON",58,58,41,3]
[2,"Bande","ETRECHY","LHOMME",42,42,44,3,"ARPAJON","GESLIN",42,34,44,1]
[2,"3 Bandes","ETRECHY","VERLEY",22,22,88,3,"ARPAJON","PINTO",16,12,88,1]
[2,"5 Quilles","ETRECHY","PORCU",70,64,49,1,"ARPAJON","THENOT",70,70,70,3]
["VETERANT"]
[2,"Rencontre","DRAVEIL - MORANGIS1","DRAVEIL",351,286,6,1,null,"MORANGIS1",485,455,10,3]
[2,"Points equipes","DRAVEIL",null,351,286,6,1,"MORANGIS1",null,485,455,10,3]
[2,"Points equipes","MORANGIS1",null,485,455,10,3,"DRAVEIL",null,351,286,6,1]
[2,"Libre","DRAVEIL","DELOBEL",64,52,28,1,"MORANGIS1","VICARI",159,159,28,3]
[2,"Bande","DRAVEIL","TAVERNIER",41,41,36,3,"MORANGIS1","FAYT",39,24,36,1]
[2,"3 Bandes","DRAVEIL","MIRLAUD",17,13,72,1,"MORANGIS1","PAIS",24,24,72,3]
[2,"5 Quilles","DRAVEIL","HUE",60,33,54,1,"MORANGIS1","ALEXANDRE",64,64,64,3]
[2,"Libre","MORANGIS1","VICARI",159,159,28,3,"DRAVEIL","DELOBEL",64,52,28,1]
[2,"Bande","MORANGIS1","FAYT",39,24,36,1,"DRAVEIL","TAVERNIER",41,41,36,3]
[2,"3 Bandes","MORANGIS1","PAIS",24,24,72,3,"DRAVEIL","MIRLAUD",17,13,72,1]
[2,"5 Quilles","MORANGIS1","ALEXANDRE",64,64,64,3,"DRAVEIL","HUE",60,33,54,1]
["VETERANT"]
[3,"Rencontre","MORANGIS2 - VIGNEUX1","MORANGIS2",419,379,10,3,null,"VIGNEUX1",431,319,6,1]
[3,"Points equipes","MORANGIS2",null,419,379,10,3,"VIGNEUX1",null,431,319,6,1]
[3,"Points equipes","VIGNEUX1",null,431,319,6,1,"MORANGIS2",null,419,379,10,3]
[3,"Libre","MORANGIS2","PREVOT",47,47,29,3,"VIGNEUX1","HELLEU",65,49,29,1]
[3,"Bande","MORANGIS2","VINGUEASSALOM",44,44,39,3,"VIGNEUX1","COSOLETO",42,35,39,1]
[3,"3 Bandes","MORANGIS2","CHAMPAGNE",20,12,60,1,"VIGNEUX1","BORDIER",18,18,60,3]
[3,"5 Quilles","MORANGIS2","AIRAULT",92,92,92,3,"VIGNEUX1","ABITBOL",96,18,92,1]
[3,"Libre","VIGNEUX1","HELLEU",65,49,29,1,"MORANGIS2","PREVOT",47,47,29,3]
[3,"Bande","VIGNEUX1","COSOLETO",42,35,39,1,"MORANGIS2","VINGUEASSALOM",44,44,39,3]
[3,"3 Bandes","VIGNEUX1","BORDIER",18,18,60,3,"MORANGIS2","CHAMPAGNE",20,12,60,1]
[3,"5 Quilles","VIGNEUX1","ABITBOL",96,18,92,1,"MORANGIS2","AIRAULT",92,92,92,3]
["VETERANT"]
[3,"Rencontre","VIGNEUX2 - DRAVEIL","VIGNEUX2",367,245,6,1,null,"DRAVEIL",393,368,10,3]
[3,"Points equipes","VIGNEUX2",null,367,245,6,1,"DRAVEIL",null,393,368,10,3]
[3,"Points equipes","DRAVEIL",null,393,368,10,3,"VIGNEUX2",null,367,245,6,1]
[3,"Libre","VIGNEUX2","MOINDREAU",69,52,43,1,"DRAVEIL","MOULAY",98,98,43,3]
[3,"Bande","VIGNEUX2","VENOT",33,14,50,1,"DRAVEIL","TAVERNIER",42,42,50,3]
[3,"3 Bandes","VIGNEUX2","ROUX",12,12,47,3,"DRAVEIL","MIRLAUD",15,10,47,1]
[3,"5 Quilles","VIGNEUX2","CATALLO",86,39,66,1,"DRAVEIL","ANNE",68,68,68,3]
[3,"Libre","DRAVEIL","MOULAY",98,98,43,3,"VIGNEUX2","MOINDREAU",69,52,43,1]
[3,"Bande","DRAVEIL","TAVERNIER",42,42,50,3,"VIGNEUX2","VENOT",33,14,50,1]
[3,"3 Bandes","DRAVEIL","MIRLAUD",15,10,47,1,"VIGNEUX2","ROUX",12,12,47,3]
[3,"5 Quilles","DRAVEIL","ANNE",68,68,68,3,"VIGNEUX2","CATALLO",86,39,66,1]
["VETERANT"]
[3,"Rencontre","ETRECHY - MORANGIS1","ETRECHY",352,251,5,1,null,"MORANGIS1",443,418,11,3]
[3,"Points equipes","ETRECHY",null,352,251,5,1,"MORANGIS1",null,443,418,11,3]
[3,"Points equipes","MORANGIS1",null,443,418,11,3,"ETRECHY",null,352,251,5,1]
[3,"Libre","ETRECHY","BENOIT",59,40,25,1,"MORANGIS1","MAILLARD",47,47,25,3]
[3,"Bande","ETRECHY","FLEURY",31,20,30,1,"MORANGIS1","COTILLARD",44,44,30,3]
[3,"3 Bandes","ETRECHY","VERLEY",19,9,35,1,"MORANGIS1","PAIS",22,22,35,3]
[3,"5 Quilles","ETRECHY","LHOMME",68,58,68,2,"MORANGIS1","ALEXANDRE",99,99,74,2]
[3,"Libre","MORANGIS1","MAILLARD",47,47,25,3,"ETRECHY","BENOIT",59,40,25,1]
[3,"Bande","MORANGIS1","COTILLARD",44,44,30,3,"ETRECHY","FLEURY",31,20,30,1]
[3,"3 Bandes","MORANGIS1","PAIS",22,22,35,3,"ETRECHY","VERLEY",19,9,35,1]
[3,"5 Quilles","MORANGIS1","ALEXANDRE",99,99,74,2,"ETRECHY","LHOMME",68,58,68,2]
["VETERANT"]
[3,"Rencontre","MASSY - ARPAJON","MASSY",369,254,9,3,null,"ARPAJON",318,257,7,1]
[3,"Points equipes","MASSY",null,369,254,9,3,"ARPAJON",null,318,257,7,1]
[3,"Points equipes","ARPAJON",null,318,257,7,1,"MASSY",null,369,254,9,3]
[3,"Libre","MASSY","LEVANIER",31,31,24,3,"ARPAJON","CUILLERAT",48,21,24,1]
[3,"Bande","MASSY","DANIAU",40,40,42,3,"ARPAJON","GODFIN",36,26,42,1]
[3,"3 Bandes","MASSY","CARON",22,4,34,1,"ARPAJON","PINTO",14,14,34,3]
[3,"5 Quilles","MASSY","CARLE",74,74,49,2,"ARPAJON","JACQUIN",64,50,64,2]
[3,"Libre","ARPAJON","CUILLERAT",48,21,24,1,"MASSY","LEVANIER",31,31,24,3]
[3,"Bande","ARPAJON","GODFIN",36,26,42,1,"MASSY","DANIAU",40,40,42,3]
[3,"3 Bandes","ARPAJON","PINTO",14,14,34,3,"MASSY","CARON",22,4,34,1]
[3,"5 Quilles","ARPAJON","JACQUIN",64,50,64,2,"MASSY","CARLE",74,74,49,2]
["VETERANT"]
[4,"Rencontre","ETRECHY - VIGNEUX2","ETRECHY",380,316,8,2,null,"VIGNEUX2",341,278,8,2]
[4,"Points equipes","ETRECHY",null,380,316,8,2,"VIGNEUX2",null,341,278,8,2]
[4,"Points equipes","VIGNEUX2",null,341,278,8,2,"ETRECHY",null,380,316,8,2]
[4,"Libre","ETRECHY","LEBROT",47,36,47,1,"VIGNEUX2","MICHELET",52,52,47,3]
[4,"Bande","ETRECHY","HOUPLAIN",54,54,33,3,"VIGNEUX2","MOINDREAU",37,18,33,1]
[4,"3 Bandes","ETRECHY","VERLEY",19,19,57,3,"VIGNEUX2","ROUX",13,8,57,1]
[4,"5 Quilles","ETRECHY","LHOMME",65,31,46,1,"VIGNEUX2","CATALLO",75,75,75,3]
[4,"Libre","VIGNEUX2","MICHELET",52,52,47,3,"ETRECHY","LEBROT",47,36,47,1]
[4,"Bande","VIGNEUX2","MOINDREAU",37,18,33,1,"ETRECHY","HOUPLAIN",54,54,33,3]
[4,"3 Bandes","VIGNEUX2","ROUX",13,8,57,1,"ETRECHY","VERLEY",19,19,57,3]
[4,"5 Quilles","VIGNEUX2","CATALLO",75,75,75,3,"ETRECHY","LHOMME",65,31,46,1]
["VETERANT"]
[4,"Rencontre","VIGNEUX1 - ARPAJON","VIGNEUX1",381,339,8,2,null,"ARPAJON",435,405,8,2]
[4,"Points equipes","VIGNEUX1",null,381,339,8,2,"ARPAJON",null,435,405,8,2]
[4,"Points equipes","ARPAJON",null,435,405,8,2,"VIGNEUX1",null,381,339,8,2]
[4,"Libre","VIGNEUX1","JOREAU",45,18,22,1,"ARPAJON","VIGNON",60,60,22,3]
[4,"Bande","VIGNEUX1","COSOLETO",42,42,41,3,"ARPAJON","GODFIN",36,27,41,1]
[4,"3 Bandes","VIGNEUX1","BORDIER",18,15,84,1,"ARPAJON","DEVILLEBICHOT",25,25,84,3]
[4,"5 Quilles","VIGNEUX1","ABITBOL",81,81,81,3,"ARPAJON","THENOT",89,82,84,1]
[4,"Libre","ARPAJON","VIGNON",60,60,22,3,"VIGNEUX1","JOREAU",45,18,22,1]
[4,"Bande","ARPAJON","GODFIN",36,27,41,1,"VIGNEUX1","COSOLETO",42,42,41,3]
[4,"3 Bandes","ARPAJON","DEVILLEBICHOT",25,25,84,3,"VIGNEUX1","BORDIER",18,15,84,1]
[4,"5 Quilles","ARPAJON","THENOT",89,82,84,1,"VIGNEUX1","ABITBOL",81,81,81,3]
["VETERANT"]
[4,"Rencontre","MORANGIS1 - MASSY","MORANGIS1",524,471,9,3,null,"MASSY",368,298,7,1]
[4,"Points equipes","MORANGIS1",null,524,471,9,3,"MASSY",null,368,298,7,1]
[4,"Points equipes","MASSY",null,368,298,7,1,"MORANGIS1",null,524,471,9,3]
[4,"Libre","MORANGIS1","VICARI",156,156,29,3,"MASSY","BRIOIT",65,51,29,1]
[4,"Bande","MORANGIS1","MAILLARD",31,31,40,3,"MASSY","VANHEE",28,14,40,1]
[4,"3 Bandes","MORANGIS1","PAIS",24,19,65,1,"MASSY","CARON",19,19,65,3]
[4,"5 Quilles","MORANGIS1","LILLO",93,93,65,2,"MASSY","CARLE",76,48,76,2]
[4,"Libre","MASSY","BRIOIT",65,51,29,1,"MORANGIS1","VICARI",156,156,29,3]
[4,"Bande","MASSY","VANHEE",28,14,40,1,"MORANGIS1","MAILLARD",31,31,40,3]
[4,"3 Bandes","MASSY","CARON",19,19,65,3,"MORANGIS1","PAIS",24,19,65,1]
[4,"5 Quilles","MASSY","CARLE",76,48,76,2,"MORANGIS1","LILLO",93,93,65,2]
["VETERANT"]
[4,"Rencontre","DRAVEIL - MORANGIS2","DRAVEIL",367,341,11,3,null,"MORANGIS2",375,279,5,1]
[4,"Points equipes","DRAVEIL",null,367,341,11,3,"MORANGIS2",null,375,279,5,1]
[4,"Points equipes","MORANGIS2",null,375,279,5,1,"DRAVEIL",null,367,341,11,3]
[4,"Libre","DRAVEIL","MOULAY",91,91,37,3,"MORANGIS2","PREVOT",57,36,37,1]
[4,"Bande","DRAVEIL","TAVERNIER",41,41,31,3,"MORANGIS2","VINGUEASSALOM",45,34,31,1]
[4,"3 Bandes","DRAVEIL","HUE",14,14,43,3,"MORANGIS2","CHAMPAGNE",18,10,43,1]
[4,"5 Quilles","DRAVEIL","MESNY",62,62,36,2,"MORANGIS2","GOT",69,56,69,2]
[4,"Libre","MORANGIS2","PREVOT",57,36,37,1,"DRAVEIL","MOULAY",91,91,37,3]
[4,"Bande","MORANGIS2","VINGUEASSALOM",45,34,31,1,"DRAVEIL","TAVERNIER",41,41,31,3]
[4,"3 Bandes","MORANGIS2","CHAMPAGNE",18,10,43,1,"DRAVEIL","HUE",14,14,43,3]
[4,"5 Quilles","MORANGIS2","GOT",69,56,69,2,"DRAVEIL","MESNY",62,62,36,2]
["VETERANT"]
[5,"Rencontre","DRAVEIL - VIGNEUX1","DRAVEIL",402,337,7,1,null,"VIGNEUX1",405,394,9,3]
[5,"Points equipes","DRAVEIL",null,402,337,7,1,"VIGNEUX1",null,405,394,9,3]
[5,"Points equipes","VIGNEUX1",null,405,394,9,3,"DRAVEIL",null,402,337,7,1]
[5,"Libre","DRAVEIL","MIRLAUD",76,51,31,1,"VIGNEUX1","HELLEU",65,65,31,3]
[5,"Bande","DRAVEIL","TAVERNIER",42,42,37,3,"VIGNEUX1","BORDIER",45,44,37,1]
[5,"3 Bandes","DRAVEIL","DESHAYES",12,8,48,1,"VIGNEUX1","COSOLETO",18,18,48,3]
[5,"5 Quilles","DRAVEIL","ANNE",91,91,71,2,"VIGNEUX1","ABITBOL",80,71,80,2]
[5,"Libre","VIGNEUX1","HELLEU",65,65,31,3,"DRAVEIL","MIRLAUD",76,51,31,1]
[5,"Bande","VIGNEUX1","BORDIER",45,44,37,1,"DRAVEIL","TAVERNIER",42,42,37,3]
[5,"3 Bandes","VIGNEUX1","COSOLETO",18,18,48,3,"DRAVEIL","DESHAYES",12,8,48,1]
[5,"5 Quilles","VIGNEUX1","ABITBOL",80,71,80,2,"DRAVEIL","ANNE",91,91,71,2]
["VETERANT"]
[5,"Rencontre","VIGNEUX2 - MASSY","VIGNEUX2",320,260,7,1,null,"MASSY",354,303,9,3]
[5,"Points equipes","VIGNEUX2",null,320,260,7,1,"MASSY",null,354,303,9,3]
[5,"Points equipes","MASSY",null,354,303,9,3,"VIGNEUX2",null,320,260,7,1]
[5,"Libre","VIGNEUX2","ANNERON",59,59,46,3,"MASSY","VANHEE",34,23,46,1]
[5,"Bande","VIGNEUX2","MOINDREAU",37,21,37,1,"MASSY","DANIAU",41,41,37,3]
[5,"3 Bandes","VIGNEUX2","ROUX",13,10,41,1,"MASSY","CARON",18,18,41,3]
[5,"5 Quilles","VIGNEUX2","VENOT",61,61,48,2,"MASSY","CARLE",74,34,74,2]
[5,"Libre","MASSY","VANHEE",34,23,46,1,"VIGNEUX2","ANNERON",59,59,46,3]
[5,"Bande","MASSY","DANIAU",41,41,37,3,"VIGNEUX2","MOINDREAU",37,21,37,1]
[5,"3 Bandes","MASSY","CARON",18,18,41,3,"VIGNEUX2","ROUX",13,10,41,1]
[5,"5 Quilles","MASSY","CARLE",74,34,74,2,"VIGNEUX2","VENOT",61,61,48,2]
["VETERANT"]
[5,"Rencontre","MORANGIS2 - ETRECHY","MORANGIS2",397,372,10,3,null,"ETRECHY",400,278,6,1]
[5,"Points equipes","MORANGIS2",null,397,372,10,3,"ETRECHY",null,400,278,6,1]
[5,"Points equipes","ETRECHY",null,400,278,6,1,"MORANGIS2",null,397,372,10,3]
[5,"Libre","MORANGIS2","MIRMAN",96,96,31,3,"ETRECHY","BENOIT",67,38,31,1]
[5,"Bande","MORANGIS2","GOT",23,23,38,3,"ETRECHY","HOUPLAIN",54,49,38,1]
[5,"3 Bandes","MORANGIS2","AIRAULT",25,20,47,1,"ETRECHY","VERLEY",19,19,47,3]
[5,"5 Quilles","MORANGIS2","TRUFFAUT",65,65,65,3,"ETRECHY","FLEURY",65,31,16,1]
[5,"Libre","ETRECHY","BENOIT",67,38,31,1,"MORANGIS2","MIRMAN",96,96,31,3]
[5,"Bande","ETRECHY","HOUPLAIN",54,49,38,1,"MORANGIS2","GOT",23,23,38,3]
[5,"3 Bandes","ETRECHY","VERLEY",19,19,47,3,"MORANGIS2","AIRAULT",25,20,47,1]
[5,"5 Quilles","ETRECHY","FLEURY",65,31,16,1,"MORANGIS2","TRUFFAUT",65,65,65,3]
["VETERANT"]
[5,"Rencontre","ARPAJON - MORANGIS1","ARPAJON",268,226,8,2,null,"MORANGIS1",553,503,8,2]
[5,"Points equipes","ARPAJON",null,268,226,8,2,"MORANGIS1",null,553,503,8,2]
[5,"Points equipes","MORANGIS1",null,553,503,8,2,"ARPAJON",null,268,226,8,2]
[5,"Libre","ARPAJON","LORENZI",40,33,38,1,"MORANGIS1","VICARI",153,153,38,3]
[5,"Bande","ARPAJON","JACQUIN",29,29,48,3,"MORANGIS1","COTILLARD",48,44,48,1]
[5,"3 Bandes","ARPAJON","GODFIN",10,3,46,1,"MORANGIS1","PAIS",22,22,46,3]
[5,"5 Quilles","ARPAJON","VIGNON",60,60,60,3,"MORANGIS1","ALEXANDRE",97,62,90,1]
[5,"Libre","MORANGIS1","VICARI",153,153,38,3,"ARPAJON","LORENZI",40,33,38,1]
[5,"Bande","MORANGIS1","COTILLARD",48,44,48,1,"ARPAJON","JACQUIN",29,29,48,3]
[5,"3 Bandes","MORANGIS1","PAIS",22,22,46,3,"ARPAJON","GODFIN",10,3,46,1]
[5,"5 Quilles","MORANGIS1","ALEXANDRE",97,62,90,1,"ARPAJON","VIGNON",60,60,60,3]
["VETERANT"]
[6,"Rencontre","VIGNEUX1 - MORANGIS1","VIGNEUX1",341,258,5,1,null,"MORANGIS1",527,498,11,3]
[6,"Points equipes","VIGNEUX1",null,341,258,5,1,"MORANGIS1",null,527,498,11,3]
[6,"Points equipes","MORANGIS1",null,527,498,11,3,"VIGNEUX1",null,341,258,5,1]
[6,"Libre","VIGNEUX1","HELLEU",67,54,26,1,"MORANGIS1","VICARI",146,146,26,3]
[6,"Bande","VIGNEUX1","COSOLETO",42,14,30,1,"MORANGIS1","MAILLARD",39,39,30,3]
[6,"3 Bandes","VIGNEUX1","BORDIER",16,15,70,1,"MORANGIS1","PAIS",23,23,70,3]
[6,"5 Quilles","VIGNEUX1","JOREAU",55,55,46,2,"MORANGIS1","ALEXANDRE",94,65,94,2]
[6,"Libre","MORANGIS1","VICARI",146,146,26,3,"VIGNEUX1","HELLEU",67,54,26,1]
[6,"Bande","MORANGIS1","MAILLARD",39,39,30,3,"VIGNEUX1","COSOLETO",42,14,30,1]
[6,"3 Bandes","MORANGIS1","PAIS",23,23,70,3,"VIGNEUX1","BORDIER",16,15,70,1]
[6,"5 Quilles","MORANGIS1","ALEXANDRE",94,65,94,2,"VIGNEUX1","JOREAU",55,55,46,2]
["VETERANT"]
[6,"Rencontre","MORANGIS2 - MASSY","MORANGIS2",376,246,4,1,null,"MASSY",306,306,12,3]
[6,"Points equipes","MORANGIS2",null,376,246,4,1,"MASSY",null,306,306,12,3]
[6,"Points equipes","MASSY",null,306,306,12,3,"MORANGIS2",null,376,246,4,1]
[6,"Libre","MORANGIS2","VALLEE",43,15,40,1,"MASSY","LEVANIER",31,31,40,3]
[6,"Bande","MORANGIS2","MIRMAN",49,44,38,1,"MASSY","AGUEFF",23,23,38,3]
[6,"3 Bandes","MORANGIS2","CHAMPAGNE",17,9,"a",1,"MASSY","CARON",19,19,42,3]
[6,"5 Quilles","MORANGIS2","GOT",75,48,50,1,"MASSY","DANIAU",67,67,67,3]
[6,"Libre","MASSY","LEVANIER",31,31,40,3,"MORANGIS2","VALLEE",43,15,40,1]
[6,"Bande","MASSY","AGUEFF",23,23,38,3,"MORANGIS2","MIRMAN",49,44,38,1]
[6,"3 Bandes","MASSY","CARON",19,19,42,3,"MORANGIS2","CHAMPAGNE",17,9,"a",1]
[6,"5 Quilles","MASSY","DANIAU",67,67,67,3,"MORANGIS2","GOT",75,48,50,1]
["VETERANT"]
[6,"Rencontre","ARPAJON - VIGNEUX2","ARPAJON",318,298,9,3,null,"VIGNEUX2",334,270,7,1]
[6,"Points equipes","ARPAJON",null,318,298,9,3,"VIGNEUX2",null,334,270,7,1]
[6,"Points equipes","VIGNEUX2",null,334,270,7,1,"ARPAJON",null,318,298,9,3]
[6,"Libre","ARPAJON","CUILLERAT",48,41,47,1,"VIGNEUX2","MOINDREAU",63,63,47,3]
[6,"Bande","ARPAJON","VIGNON",35,35,45,3,"VIGNEUX2","MICHELET",35,28,45,1]
[6,"3 Bandes","ARPAJON","GODFIN",10,10,61,3,"VIGNEUX2","ROUX",13,12,61,1]
[6,"5 Quilles","ARPAJON","JACQUIN",75,62,75,2,"VIGNEUX2","VENOT",68,68,23,2]
[6,"Libre","VIGNEUX2","MOINDREAU",63,63,47,3,"ARPAJON","CUILLERAT",48,41,47,1]
[6,"Bande","VIGNEUX2","MICHELET",35,28,45,1,"ARPAJON","VIGNON",35,35,45,3]
[6,"3 Bandes","VIGNEUX2","ROUX",13,12,61,1,"ARPAJON","GODFIN",10,10,61,3]
[6,"5 Quilles","VIGNEUX2","VENOT",68,68,23,2,"ARPAJON","JACQUIN",75,62,75,2]
["VETERANT"]
[7,"Rencontre","MASSY - DRAVEIL","MASSY",365,317,8,2,null,"DRAVEIL",354,330,8,2]
[7,"Points equipes","MASSY",null,365,317,8,2,"DRAVEIL",null,354,330,8,2]
[7,"Points equipes","DRAVEIL",null,354,330,8,2,"MASSY",null,365,317,8,2]
[7,"Libre","MASSY","LEVANIER",31,31,35,3,"DRAVEIL","MIRLAUD",72,58,35,1]
[7,"Bande","MASSY","DANIAU",42,40,41,1,"DRAVEIL","TAVERNIER",43,43,41,3]
[7,"3 Bandes","MASSY","CARON",20,20,59,3,"DRAVEIL","LAMPLE",14,12,59,1]
[7,"5 Quilles","MASSY","CARLE",75,71,35,1,"DRAVEIL","HUE",63,63,63,3]
[7,"Libre","DRAVEIL","MIRLAUD",72,58,35,1,"MASSY","LEVANIER",31,31,35,3]
[7,"Bande","DRAVEIL","TAVERNIER",43,43,41,3,"MASSY","DANIAU",42,40,41,1]
[7,"3 Bandes","DRAVEIL","LAMPLE",14,12,59,1,"MASSY","CARON",20,20,59,3]
[7,"5 Quilles","DRAVEIL","HUE",63,63,63,3,"MASSY","CARLE",75,71,35,1]
["VETERANT"]
[7,"Rencontre","VIGNEUX1 - ETRECHY","VIGNEUX1",355,287,6,1,null,"ETRECHY",362,332,10,3]
[7,"Points equipes","VIGNEUX1",null,355,287,6,1,"ETRECHY",null,362,332,10,3]
[7,"Points equipes","ETRECHY",null,362,332,10,3,"VIGNEUX1",null,355,287,6,1]
[7,"Libre","VIGNEUX1","HELLEU",69,31,28,1,"ETRECHY","BENOIT",61,61,28,3]
[7,"Bande","VIGNEUX1","BIDE",42,36,42,1,"ETRECHY","LHOMME",42,42,42,3]
[7,"3 Bandes","VIGNEUX1","BORDIER",16,16,23,3,"ETRECHY","VERLEY",19,13,23,1]
[7,"5 Quilles","VIGNEUX1","JOREAU",61,58,46,1,"ETRECHY","LHOMME",61,61,61,3]
[7,"Libre","ETRECHY","BENOIT",61,61,28,3,"VIGNEUX1","HELLEU",69,31,28,1]
[7,"Bande","ETRECHY","LHOMME",42,42,42,3,"VIGNEUX1","BIDE",42,36,42,1]
[7,"3 Bandes","ETRECHY","VERLEY",19,13,23,1,"VIGNEUX1","BORDIER",16,16,23,3]
[7,"5 Quilles","ETRECHY","LHOMME",61,61,61,3,"VIGNEUX1","JOREAU",61,58,46,1]
["VETERANT"]
[7,"Rencontre","ARPAJON - MORANGIS2","ARPAJON",388,330,6,1,null,"MORANGIS2",385,380,10,3]
[7,"Points equipes","ARPAJON",null,388,330,6,1,"MORANGIS2",null,385,380,10,3]
[7,"Points equipes","MORANGIS2",null,385,380,10,3,"ARPAJON",null,388,330,6,1]
[7,"Libre","ARPAJON","LORENZI",43,40,65,1,"MORANGIS2","PREVOT",54,54,65,3]
[7,"Bande","ARPAJON","VIGNON",37,28,38,1,"MORANGIS2","VINGUEASSALOM",45,45,38,3]
[7,"3 Bandes","ARPAJON","DEVILLEBICHOT",21,21,60,3,"MORANGIS2","CHAMPAGNE",19,18,60,1]
[7,"5 Quilles","ARPAJON","THENOT",83,59,70,1,"MORANGIS2","MIRMAN",73,73,73,3]
[7,"Libre","MORANGIS2","PREVOT",54,54,65,3,"ARPAJON","LORENZI",43,40,65,1]
[7,"Bande","MORANGIS2","VINGUEASSALOM",45,45,38,3,"ARPAJON","VIGNON",37,28,38,1]
[7,"3 Bandes","MORANGIS2","CHAMPAGNE",19,18,60,1,"ARPAJON","DEVILLEBICHOT",21,21,60,3]
[7,"5 Quilles","MORANGIS2","MIRMAN",73,73,73,3,"ARPAJON","THENOT",83,59,70,1]
["VETERANT"]
[7,"Rencontre","MORANGIS1 - VIGNEUX2","MORANGIS1",528,500,9,3,null,"VIGNEUX2",373,294,7,1]
[7,"Points equipes","MORANGIS1",null,528,500,9,3,"VIGNEUX2",null,373,294,7,1]
[7,"Points equipes","VIGNEUX2",null,373,294,7,1,"MORANGIS1",null,528,500,9,3]
[7,"Libre","MORANGIS1","VICARI",146,146,26,3,"VIGNEUX2","MOINDREAU",62,44,26,1]
[7,"Bande","MORANGIS1","PRIEUR",39,29,61,1,"VIGNEUX2","MICHELET",36,36,61,3]
[7,"3 Bandes","MORANGIS1","PAIS",22,22,37,3,"VIGNEUX2","ROUX",13,7,37,1]
[7,"5 Quilles","MORANGIS1","ALEXANDRE",97,97,89,2,"VIGNEUX2","CATALLO",87,56,87,2]
[7,"Libre","VIGNEUX2","MOINDREAU",62,44,26,1,"MORANGIS1","VICARI",146,146,26,3]
[7,"Bande","VIGNEUX2","MICHELET",36,36,61,3,"MORANGIS1","PRIEUR",39,29,61,1]
[7,"3 Bandes","VIGNEUX2","ROUX",13,7,37,1,"MORANGIS1","PAIS",22,22,37,3]
[7,"5 Quilles","VIGNEUX2","CATALLO",87,56,87,2,"MORANGIS1","ALEXANDRE",97,97,89,2]

{"sheet":"Calculs equipes","index":12,"n_rows":66,"n_cols":17,"rows_kept":66,"cut":false,"hidden":true,"merged":[]}
[]
["Nbr rencontres  par équipe"]
[]
["Type","(Plusieurs éléments)"]
[]
["Nombre de Journée","Equipe"]
[null,"MORANGIS1","MORANGIS2","ETRECHY","MASSY","DRAVEIL","ARPAJON","VIGNEUX1","VIGNEUX2"]
["Total",7,7,6,7,6,7,7,7]
[]
[]
[]
["Points Matchs par équipe"]
[]
["Type","(Plusieurs éléments)"]
[]
["Somme de pt match","Equipe"]
[null,"MORANGIS1","MORANGIS2","ETRECHY","MASSY","DRAVEIL","ARPAJON","VIGNEUX1","VIGNEUX2"]
["Total",18,17,10,17,11,14,13,8]
[]
[]
["Points  pour/contre par équipe"]
[]
["Type","(Plusieurs éléments)"]
[]
[null,"Equipe","Données"]
[null,"MORANGIS1",null,"MORANGIS2",null,"ETRECHY",null,"MASSY",null,"DRAVEIL",null,"ARPAJON",null,"VIGNEUX1",null,"VIGNEUX2"]
[null,"+","-","+","-","+","-","+","-","+","-","+","-","+","-","+","-"]
["Total",65,47,57,55,43,53,63,49,48,48,56,56,52,60,48,64]
[]
[]
["Distance (points à faire) et  points faits  par équipe"]
[]
["Type","(Plusieurs éléments)"]
[]
[null,"Equipe","Données"]
[null,"MORANGIS1",null,"MORANGIS2",null,"ETRECHY",null,"MASSY",null,"DRAVEIL",null,"ARPAJON",null,"VIGNEUX1",null,"VIGNEUX2"]
[null,"Points à faire","Points faits","Points à faire","Points faits","Points à faire","Points faits","Points à faire","Points faits","Points à faire","Points faits","Points à faire","Points faits","Points à faire","Points faits","Points à faire","Points faits"]
["Total",3559,3311,2744,2359,2287,1873,2576,2190,2305,2042,2431,2176,2796,2431,2371,1868]
[]
[]
["Coefficient ( Points faits / distance)   par équipe"]
[]
["Type","(Plusieurs éléments)"]
[]
["Moyenne de Coefficient","Equipe"]
[null,"MORANGIS1","MORANGIS2","ETRECHY","MASSY","DRAVEIL","ARPAJON","VIGNEUX1","VIGNEUX2"]
["Total",0.93031750491711152,0.85969387755102045,0.81897682553563622,0.85015527950310554,0.88590021691973975,0.8951048951048951,0.86945636623748213,0.78785322648671452]
[]
[]
["Classement non trié",null,null,null,null,null,null,null,"Classement trié"]
[]
["Equipe","jouées","pts","pour","contre","différence","coefficient",null,"Equipe","jouées","pts","pour","contre","différence","coefficient"]
[{"$f":"Gestion!C2","v":"ARPAJON"},{"$f":"IFERROR(GETPIVOTDATA(\"Journée\",'Calculs equipes'!$A$6,\"Equipe\",A53),\"\")","v":7},{"$f":"IFERROR(GETPIVOTDATA(\"Somme de pt match\",'Calculs equipes'!$A$16,\"Equipe\",A53),0)","v":14},{"$f":"IFERROR(GETPIVOTDATA(\"+\",'Calculs equipes'!$A$25,\"Equipe\",A53),0)","v":56},{"$f":"IFERROR(GETPIVOTDATA(\"-\",'Calculs equipes'!$A$25,\"Equipe\",A53),0)","v":56},{"$f":"D53-E53","v":0},{"$f":"IFERROR(GETPIVOTDATA(\"Coefficient\",$A$45,\"Equipe\",A53),\"\")","v":0.8951048951048951},null,{"$f":"_xlfn._xlws.SORT('Calculs equipes'!$A$53:$G$66,{3;6;1},{-1;-1;-1})","v":"MORANGIS1"},7,18,65,47,18,0.93031750491711152]
[{"$f":"Gestion!C3","v":"DRAVEIL"},{"$f":"IFERROR(GETPIVOTDATA(\"Journée\",'Calculs equipes'!$A$6,\"Equipe\",A54),\"\")","v":6},{"$f":"IFERROR(GETPIVOTDATA(\"Somme de pt match\",'Calculs equipes'!$A$16,\"Equipe\",A54),0)","v":11},{"$f":"IFERROR(GETPIVOTDATA(\"+\",'Calculs equipes'!$A$25,\"Equipe\",A54),0)","v":48},{"$f":"IFERROR(GETPIVOTDATA(\"-\",'Calculs equipes'!$A$25,\"Equipe\",A54),0)","v":48},0,0.88590021691973975,null,"MASSY",7,17,63,49,14,0.85015527950310554]
[{"$f":"Gestion!C4","v":"ETRECHY"},{"$f":"IFERROR(GETPIVOTDATA(\"Journée\",'Calculs equipes'!$A$6,\"Equipe\",A55),\"\")","v":6},{"$f":"IFERROR(GETPIVOTDATA(\"Somme de pt match\",'Calculs equipes'!$A$16,\"Equipe\",A55),0)","v":10},{"$f":"IFERROR(GETPIVOTDATA(\"+\",'Calculs equipes'!$A$25,\"Equipe\",A55),0)","v":43},{"$f":"IFERROR(GETPIVOTDATA(\"-\",'Calculs equipes'!$A$25,\"Equipe\",A55),0)","v":53},-10,0.81897682553563622,null,"MORANGIS2",7,17,57,55,2,0.85969387755102045]
[{"$f":"Gestion!C5","v":"MASSY"},{"$f":"IFERROR(GETPIVOTDATA(\"Journée\",'Calculs equipes'!$A$6,\"Equipe\",A56),\"\")","v":7},{"$f":"IFERROR(GETPIVOTDATA(\"Somme de pt match\",'Calculs equipes'!$A$16,\"Equipe\",A56),0)","v":17},{"$f":"IFERROR(GETPIVOTDATA(\"+\",'Calculs equipes'!$A$25,\"Equipe\",A56),0)","v":63},{"$f":"IFERROR(GETPIVOTDATA(\"-\",'Calculs equipes'!$A$25,\"Equipe\",A56),0)","v":49},14,0.85015527950310554,null,"ARPAJON",7,14,56,56,0,0.8951048951048951]
[{"$f":"Gestion!C6","v":"MORANGIS1"},{"$f":"IFERROR(GETPIVOTDATA(\"Journée\",'Calculs equipes'!$A$6,\"Equipe\",A57),\"\")","v":7},{"$f":"IFERROR(GETPIVOTDATA(\"Somme de pt match\",'Calculs equipes'!$A$16,\"Equipe\",A57),0)","v":18},{"$f":"IFERROR(GETPIVOTDATA(\"+\",'Calculs equipes'!$A$25,\"Equipe\",A57),0)","v":65},{"$f":"IFERROR(GETPIVOTDATA(\"-\",'Calculs equipes'!$A$25,\"Equipe\",A57),0)","v":47},18,0.93031750491711152,null,"VIGNEUX1",7,13,52,60,-8,0.86945636623748213]
[{"$f":"Gestion!C7","v":"MORANGIS2"},{"$f":"IFERROR(GETPIVOTDATA(\"Journée\",'Calculs equipes'!$A$6,\"Equipe\",A58),\"\")","v":7},{"$f":"IFERROR(GETPIVOTDATA(\"Somme de pt match\",'Calculs equipes'!$A$16,\"Equipe\",A58),0)","v":17},{"$f":"IFERROR(GETPIVOTDATA(\"+\",'Calculs equipes'!$A$25,\"Equipe\",A58),0)","v":57},{"$f":"IFERROR(GETPIVOTDATA(\"-\",'Calculs equipes'!$A$25,\"Equipe\",A58),0)","v":55},2,0.85969387755102045,null,"DRAVEIL",6,11,48,48,0,0.88590021691973975]
[{"$f":"Gestion!C8","v":"VIGNEUX1"},{"$f":"IFERROR(GETPIVOTDATA(\"Journée\",'Calculs equipes'!$A$6,\"Equipe\",A59),\"\")","v":7},{"$f":"IFERROR(GETPIVOTDATA(\"Somme de pt match\",'Calculs equipes'!$A$16,\"Equipe\",A59),0)","v":13},{"$f":"IFERROR(GETPIVOTDATA(\"+\",'Calculs equipes'!$A$25,\"Equipe\",A59),0)","v":52},{"$f":"IFERROR(GETPIVOTDATA(\"-\",'Calculs equipes'!$A$25,\"Equipe\",A59),0)","v":60},-8,0.86945636623748213,null,"ETRECHY",6,10,43,53,-10,0.81897682553563622]
[{"$f":"Gestion!C9","v":"VIGNEUX2"},{"$f":"IFERROR(GETPIVOTDATA(\"Journée\",'Calculs equipes'!$A$6,\"Equipe\",A60),\"\")","v":7},{"$f":"IFERROR(GETPIVOTDATA(\"Somme de pt match\",'Calculs equipes'!$A$16,\"Equipe\",A60),0)","v":8},{"$f":"IFERROR(GETPIVOTDATA(\"+\",'Calculs equipes'!$A$25,\"Equipe\",A60),0)","v":48},{"$f":"IFERROR(GETPIVOTDATA(\"-\",'Calculs equipes'!$A$25,\"Equipe\",A60),0)","v":64},-16,0.78785322648671452,null,"VIGNEUX2",7,8,48,64,-16,0.78785322648671452]
[{"$f":"Gestion!C10","v":"-"},{"$f":"IFERROR(GETPIVOTDATA(\"Journée\",'Calculs equipes'!$A$6,\"Equipe\",A61),\"\")","v":""},{"$f":"IFERROR(GETPIVOTDATA(\"Somme de pt match\",'Calculs equipes'!$A$16,\"Equipe\",A61),0)","v":0},{"$f":"IFERROR(GETPIVOTDATA(\"+\",'Calculs equipes'!$A$25,\"Equipe\",A61),0)","v":0},{"$f":"IFERROR(GETPIVOTDATA(\"-\",'Calculs equipes'!$A$25,\"Equipe\",A61),0)","v":0},0,"",null,"-","",0,0,0,0,""]
[{"$f":"Gestion!C11","v":"-"},{"$f":"IFERROR(GETPIVOTDATA(\"Journée\",'Calculs equipes'!$A$6,\"Equipe\",A62),\"\")","v":""},{"$f":"IFERROR(GETPIVOTDATA(\"Somme de pt match\",'Calculs equipes'!$A$16,\"Equipe\",A62),0)","v":0},{"$f":"IFERROR(GETPIVOTDATA(\"+\",'Calculs equipes'!$A$25,\"Equipe\",A62),0)","v":0},{"$f":"IFERROR(GETPIVOTDATA(\"-\",'Calculs equipes'!$A$25,\"Equipe\",A62),0)","v":0},{"$f":"D62-E62","v":0},{"$f":"IFERROR(GETPIVOTDATA(\"Coefficient\",$A$45,\"Equipe\",A62),\"\")","v":""},null,"-","",0,0,0,0,""]
[{"$f":"Gestion!C12","v":"-"},{"$f":"IFERROR(GETPIVOTDATA(\"Journée\",'Calculs equipes'!$A$6,\"Equipe\",A63),\"\")","v":""},{"$f":"IFERROR(GETPIVOTDATA(\"Somme de pt match\",'Calculs equipes'!$A$16,\"Equipe\",A63),0)","v":0},{"$f":"IFERROR(GETPIVOTDATA(\"+\",'Calculs equipes'!$A$25,\"Equipe\",A63),0)","v":0},{"$f":"IFERROR(GETPIVOTDATA(\"-\",'Calculs equipes'!$A$25,\"Equipe\",A63),0)","v":0},{"$f":"D63-E63","v":0},{"$f":"IFERROR(GETPIVOTDATA(\"Coefficient\",$A$45,\"Equipe\",A63),\"\")","v":""},null,"-","",0,0,0,0,""]
[{"$f":"Gestion!C13","v":"-"},{"$f":"IFERROR(GETPIVOTDATA(\"Journée\",'Calculs equipes'!$A$6,\"Equipe\",A64),\"\")","v":""},{"$f":"IFERROR(GETPIVOTDATA(\"Somme de pt match\",'Calculs equipes'!$A$16,\"Equipe\",A64),0)","v":0},{"$f":"IFERROR(GETPIVOTDATA(\"+\",'Calculs equipes'!$A$25,\"Equipe\",A64),0)","v":0},{"$f":"IFERROR(GETPIVOTDATA(\"-\",'Calculs equipes'!$A$25,\"Equipe\",A64),0)","v":0},{"$f":"D64-E64","v":0},{"$f":"IFERROR(GETPIVOTDATA(\"Coefficient\",$A$45,\"Equipe\",A64),\"\")","v":""}]
[{"$f":"Gestion!C14","v":"-"},{"$f":"IFERROR(GETPIVOTDATA(\"Journée\",'Calculs equipes'!$A$6,\"Equipe\",A65),\"\")","v":""},{"$f":"IFERROR(GETPIVOTDATA(\"Somme de pt match\",'Calculs equipes'!$A$16,\"Equipe\",A65),0)","v":0},{"$f":"IFERROR(GETPIVOTDATA(\"+\",'Calculs equipes'!$A$25,\"Equipe\",A65),0)","v":0},{"$f":"IFERROR(GETPIVOTDATA(\"-\",'Calculs equipes'!$A$25,\"Equipe\",A65),0)","v":0},{"$f":"D65-E65","v":0},{"$f":"IFERROR(GETPIVOTDATA(\"Coefficient\",$A$45,\"Equipe\",A65),\"\")","v":""}]
[{"$f":"Gestion!C15","v":"-"},{"$f":"IFERROR(GETPIVOTDATA(\"Journée\",'Calculs equipes'!$A$6,\"Equipe\",A66),\"\")","v":""},{"$f":"IFERROR(GETPIVOTDATA(\"Somme de pt match\",'Calculs equipes'!$A$16,\"Equipe\",A66),0)","v":0},{"$f":"IFERROR(GETPIVOTDATA(\"+\",'Calculs equipes'!$A$25,\"Equipe\",A66),0)","v":0},{"$f":"IFERROR(GETPIVOTDATA(\"-\",'Calculs equipes'!$A$25,\"Equipe\",A66),0)","v":0},{"$f":"D66-E66","v":0},{"$f":"IFERROR(GETPIVOTDATA(\"Coefficient\",$A$45,\"Equipe\",A66),\"\")","v":""}]

{"sheet":"Calculs joueurs","index":13,"n_rows":32,"n_cols":22,"rows_kept":32,"cut":false,"hidden":true,"merged":[]}
[]
["Résultat joueurs"]
[]
["Type","(Plusieurs éléments)",null,null,null,"Type","(Plusieurs éléments)",null,null,null,null,"Type","(Plusieurs éléments)",null,null,null,null,"Type","(Plusieurs éléments)"]
[]
[null,"Données",null,null,null,null,"Données",null,null,null,null,null,"Données",null,null,null,null,null,"Données"]
["Joueur ","Nb parties","Total points","Total reprises",null,"Joueur ","Nb parties","Total points","Total reprises",null,null,"Joueur ","Nb parties","Total points","Total reprises",null,null,"Joueur ","Nb parties","Total pt match","Total points joueur","Total points adversaire"]
["DELOBEL",1,52,28,null,"FAYT",2,58,79,null,null,"CARON",6,101,290,null,null,"CATALLO",4,8,510,494]
["BRIOIT",3,189,124,null,"GESLIN",1,34,44,null,null,"DESHAYES",1,8,48,null,null,"DESHAYES",1,1,104,120]
["VALLEE",1,15,40,null,"GODFIN",3,89,142,null,null,"GODFIN",2,13,107,null,null,"GESLIN",1,3,120,104]
["VINGUEASSALOM",2,153,88,null,"DANIAU",4,151,158,null,null,"DANIAU",1,17,38,null,null,"DANIAU",1,3,134,98]
["ANNERON",1,59,46,null,"COTILLARD",2,88,78,null,null,"CHAMPAGNE",5,68,212,null,null,"ABITBOL",5,12,799,782]
["MOULAY",2,189,80,null,"VINGUEASSALOM",3,123,108,null,null,"AIRAULT",2,44,98,null,null,"PORCU",2,2,219,268]
["VICARI",6,921,173,null,"BORDIER",1,44,37,null,null,"BORDIER",6,94,334,null,null,"AIRAULT",1,3,184,110]
["MIRLAUD",2,109,66,null,"LHOMME",2,84,86,null,null,"VERLEY",6,100,299,null,null,"LHOMME",3,6,325,427]
["VANHEE",1,23,46,null,"FLEURY",1,20,30,null,null,"MOULAY",1,23,44,null,null,"FLEURY",1,1,47,130]
["PREVOT",3,137,131,null,"TAVERNIER",6,247,254,null,null,"PAIS",7,154,376,null,null,"MESNY",1,2,98,125]
["VIGNON",2,118,63,null,"JACQUIN",1,29,48,null,null,"MIRLAUD",2,23,119,null,null,"ALEXANDRE",5,10,798,577]
["HELLEU",6,327,209,null,"HOUPLAIN",3,159,109,null,null,"ROUX",7,64,351,null,null,"THENOT",3,5,435,421]
["MICHELET",3,154,149,null,"VANHEE",2,26,111,null,null,"PINTO",2,26,122,null,null,"JACQUIN",2,4,251,214]
["LOUBIGNAC",2,81,81,null,"VIGNON",2,63,83,null,null,"LAMPLE",1,12,59,null,null,"CARLE",6,11,761,833]
["MIRMAN",1,96,31,null,"MICHELET",2,64,106,null,null,"DEVILLEBICHOT",3,68,188,null,null,"ANNE",2,5,298,256]
["MAILLARD",1,47,25,null,"BIDE",2,83,113,null,null,"COSOLETO",1,18,48,null,null,"VIGNON",1,3,120,152]
["LAMPLE",1,85,27,null,"MIRMAN",1,44,38,null,null,"HUE",1,14,43,null,null,"LILLO",2,4,285,220]
["CUILLERAT",3,94,98,null,"MAILLARD",2,70,70,null,null,null,null,null,null,null,null,"MIRMAN",1,3,146,129]
["MOINDREAU",3,159,116,null,"VILLET",2,72,91,null,null,null,null,null,null,null,null,"TRUFFAUT",1,3,130,47]
["BENOIT",3,139,84,null,"GOT",1,23,38,null,null,null,null,null,null,null,null,"GOT",4,7,414,471]
["LEVANIER",3,93,99,null,"COSOLETO",4,134,158,null,null,null,null,null,null,null,null,"VENOT",3,5,298,401]
["LEBROT",1,36,47,null,"MOINDREAU",4,106,166,null,null,null,null,null,null,null,null,"HUE",2,4,213,234]
["JOREAU",1,18,22,null,"VENOT",1,14,50,null,null,null,null,null,null,null,null,"JOREAU",2,3,205,281]
["LORENZI",2,73,103,null,"AGUEFF",1,23,38]
[null,null,null,null,null,"PRIEUR",1,29,61]

{"sheet":"Resultat","index":14,"n_rows":33,"n_cols":14,"rows_kept":33,"cut":false,"hidden":false,"merged":[[0,0,0,2],[15,5,15,11],[12,0,12,2]]}
["Zone de travail pour la copie d'une feuille de match"]
[{"$f":"Journee_classement+1","v":8},"Rencontre",{"$f":"CONCATENATE(D2,\" - \",J2)","v":"- - -"},{"$f":"'Feuille-match'!$C$8","v":"-"},{"$f":"E5+2*E6+5*E7+E8+E8","v":{"$error":"#VALUE!"}},{"$f":"F5+2*F6+5*F7+F8+G8","v":0},{"$f":"H5+H6+H7+H8","v":{"$error":"#VALUE!"}},{"$f":"IF(G2>M2,3,IF(G2<M2,1,2))","v":{"$error":"#VALUE!"}},null,{"$f":"'Feuille-match'!$K$8","v":"-"},{"$f":"K5+2*K6+5*K7+K8+K8","v":{"$error":"#VALUE!"}},{"$f":"L5+2*L6+5*L7+L8+M8","v":0},{"$f":"N5+N6+N7+N8","v":{"$error":"#VALUE!"}},{"$f":"IF(M2>G2,3,IF(M2<G2,1,2))","v":{"$error":"#VALUE!"}}]
[8,"Points equipes",{"$f":"D2","v":"-"},null,{"$f":"E2","v":{"$error":"#VALUE!"}},{"$f":"F2","v":0},{"$f":"G2","v":{"$error":"#VALUE!"}},{"$f":"H2","v":{"$error":"#VALUE!"}},{"$f":"J2","v":"-"},null,{"$f":"K2","v":{"$error":"#VALUE!"}},{"$f":"L2","v":0},{"$f":"M2","v":{"$error":"#VALUE!"}},{"$f":"N2","v":{"$error":"#VALUE!"}}]
[8,"Points equipes",{"$f":"J2","v":"-"},null,{"$f":"K2","v":{"$error":"#VALUE!"}},{"$f":"L2","v":0},{"$f":"M2","v":{"$error":"#VALUE!"}},{"$f":"N2","v":{"$error":"#VALUE!"}},{"$f":"D2","v":"-"},null,{"$f":"E2","v":{"$error":"#VALUE!"}},{"$f":"F2","v":0},{"$f":"G2","v":{"$error":"#VALUE!"}},{"$f":"H2","v":{"$error":"#VALUE!"}}]
[8,{"$f":"'Feuille-match'!$B$12","v":"Libre"},{"$f":"$D$2","v":"-"},{"$f":"'Feuille-match'!B13","v":"-"},{"$f":"'Feuille-match'!C13","v":""},{"$f":"'Feuille-match'!D13","v":0},{"$f":"'Feuille-match'!E13","v":0},{"$f":"'Feuille-match'!H13","v":""},{"$f":"$J$2","v":"-"},{"$f":"'Feuille-match'!J13","v":"-"},{"$f":"'Feuille-match'!K13","v":""},{"$f":"'Feuille-match'!L13","v":0},{"$f":"'Feuille-match'!M13","v":0},{"$f":"'Feuille-match'!P13","v":""}]
[8,{"$f":"'Feuille-match'!$B$15","v":"Bande"},{"$f":"$D$2","v":"-"},{"$f":"'Feuille-match'!B16","v":"-"},{"$f":"'Feuille-match'!C16","v":""},{"$f":"'Feuille-match'!D16","v":0},{"$f":"'Feuille-match'!E16","v":0},{"$f":"'Feuille-match'!H16","v":""},{"$f":"$J$2","v":"-"},{"$f":"'Feuille-match'!J16","v":"-"},{"$f":"'Feuille-match'!K16","v":""},{"$f":"'Feuille-match'!L16","v":0},{"$f":"'Feuille-match'!M16","v":0},{"$f":"'Feuille-match'!P16","v":""}]
[8,{"$f":"'Feuille-match'!$B$18","v":"3 Bandes"},{"$f":"$D$2","v":"-"},{"$f":"'Feuille-match'!B19","v":"-"},{"$f":"'Feuille-match'!C19","v":""},{"$f":"'Feuille-match'!D19","v":0},{"$f":"'Feuille-match'!E19","v":0},{"$f":"'Feuille-match'!H19","v":""},{"$f":"$J$2","v":"-"},{"$f":"'Feuille-match'!J19","v":"-"},{"$f":"'Feuille-match'!K19","v":""},{"$f":"'Feuille-match'!L19","v":0},{"$f":"'Feuille-match'!M19","v":0},{"$f":"'Feuille-match'!P19","v":""}]
[8,{"$f":"'Feuille-match'!$B$21","v":"5 Quilles"},{"$f":"$D$2","v":"-"},{"$f":"'Feuille-match'!B22","v":"-"},{"$f":"'Feuille-match'!C22","v":""},{"$f":"'Feuille-match'!D22","v":0},{"$f":"'Feuille-match'!E22","v":0},{"$f":"'Feuille-match'!H22","v":""},{"$f":"$J$2","v":"-"},{"$f":"'Feuille-match'!J22","v":"-"},{"$f":"'Feuille-match'!K22","v":""},{"$f":"'Feuille-match'!L22","v":0},{"$f":"'Feuille-match'!M22","v":0},{"$f":"'Feuille-match'!P22","v":""}]
[8,{"$f":"'Feuille-match'!$B$12","v":"Libre"},{"$f":"I5","v":"-"},"-","",0,0,"",{"$f":"C5","v":"-"},"-","",0,0,""]
[8,{"$f":"'Feuille-match'!$B$15","v":"Bande"},"-","-","",0,0,"","-","-","",0,0,""]
[8,{"$f":"'Feuille-match'!$B$18","v":"3 Bandes"},"-","-","",0,0,"","-","-","",0,0,""]
[8,{"$f":"'Feuille-match'!$B$21","v":"5 Quilles"},"-","-","",0,0,"","-","-","",0,0,""]
["Zone de travail pour l'intégration d'un résultat"]
[{"$f":"CONCATENATE(\"Equipe recevante : \",D23)","v":"Equipe recevante : MORANGIS1"}]
[{"$f":"CONCATENATE(\"Equipe visiteur : \", J23)","v":"Equipe visiteur : VIGNEUX2"}]
[{"$f":"CONCATENATE(\"Score : \",D23,\" \",G23,\" - \",M23,\" \",J23)","v":"Score : MORANGIS1 9 - 7 VIGNEUX2"},null,null,null,null,"!!! NE PAS MODIFIER !!!  Utiliser par les macros de COPIER et COLLER des résultats"]
[{"$f":"CONCATENATE(B5,\" : \",D23,\" \",H26,\" - \",N26,\" \",J23)","v":"Libre : MORANGIS1 3 - 1 VIGNEUX2"}]
[{"$f":"CONCATENATE(B6,\" : \",D23,\" \",H27,\" - \",N27,\" \",J23)","v":"Bande : MORANGIS1 1 - 3 VIGNEUX2"}]
[{"$f":"CONCATENATE(B7,\" : \",D23,\" \",H28,\" - \",N28,\" \",J23)","v":"3 Bandes : MORANGIS1 3 - 1 VIGNEUX2"}]
[{"$f":"CONCATENATE(B8,\" : \",D23,\" \",H29,\" - \",N29,\" \",J23)","v":"5 Quilles : MORANGIS1 2 - 2 VIGNEUX2"}]
[]
["VETERANT"]
[7,"Rencontre","MORANGIS1 - VIGNEUX2","MORANGIS1",528,500,9,3,null,"VIGNEUX2",373,294,7,1]
[7,"Points equipes","MORANGIS1",null,528,500,9,3,"VIGNEUX2",null,373,294,7,1]
[7,"Points equipes","VIGNEUX2",null,373,294,7,1,"MORANGIS1",null,528,500,9,3]
[7,"Libre","MORANGIS1","VICARI",146,146,26,3,"VIGNEUX2","MOINDREAU",62,44,26,1]
[7,"Bande","MORANGIS1","PRIEUR",39,29,61,1,"VIGNEUX2","MICHELET",36,36,61,3]
[7,"3 Bandes","MORANGIS1","PAIS",22,22,37,3,"VIGNEUX2","ROUX",13,7,37,1]
[7,"5 Quilles","MORANGIS1","ALEXANDRE",97,97,89,2,"VIGNEUX2","CATALLO",87,56,87,2]
[7,"Libre","VIGNEUX2","MOINDREAU",62,44,26,1,"MORANGIS1","VICARI",146,146,26,3]
[7,"Bande","VIGNEUX2","MICHELET",36,36,61,3,"MORANGIS1","PRIEUR",39,29,61,1]
[7,"3 Bandes","VIGNEUX2","ROUX",13,7,37,1,"MORANGIS1","PAIS",22,22,37,3]
[7,"5 Quilles","VIGNEUX2","CATALLO",87,56,87,2,"MORANGIS1","ALEXANDRE",97,97,89,2]

{"sheet":"5QUILLES","index":15,"n_rows":130,"n_cols":21,"rows_kept":130,"cut":false,"hidden":false,"merged":[[2,7,2,10]]}
["distance 5 quilles",null,null,{"$f":"CONCATENATE(\"d= \",distance_quilles_c,\" m² +\",distance_quilles_b,\" m +\",distance_quilles_a)","v":"d= -2 m² +50 m +30"}]
[]
[null,"resultats CDBE  saison 2023-2024",null,null,null,null,null,"Ranking FFB 2023-2024 (124 joueurs)",null,null,null,null,"résultats révérants après 13 jours"]
[null,null,"moyenne","points joueurs","points adverses","distance",null,null,"min","max","moyenne top 10",null,"Joueur ","Nb parties","Total pt match","distance eval","Pts Jr","Pts adv","Moyenne pt marqués","% gain","Moyenne"]
["1er","GUERIN",{"$f":"D5/E5","v":1.404494382022472},2000,1424,{"$f":"distance_quilles_a+distance_quilles_b*C5+distance_quilles_c*C5^2","v":96.27951016285823},null,null,{"$f":"MIN(K7:K130)","v":44.492950219999997},{"$f":"MAX(K7:K130)","v":100.93100792},{"$f":"AVERAGE(K7:K16)","v":83.039422823999999},null,"MOREL",4,10,{"$f":"INDEX(Moyennes!$AI$6:$AI$144,MATCH(M5,Joueurs,0))","v":72},634,345,{"$f":"Q5/(2*N5)","v":79.25},{"$f":"(O5-N5)/(N5*2)","v":0.75},{"$f":"Q5/R5","v":1.8376811594202898}]
["2éme","DUVERNOY",{"$f":"D6/E6","v":1.75},1946,1112,111.375,null,null,"Nom-Prénom","Moyenne",null,null,"CATALLO",4,11,{"$f":"INDEX(Moyennes!$AI$6:$AI$144,MATCH(M6,Joueurs,0))","v":62},398,227,{"$f":"Q6/(2*N6)","v":49.75},{"$f":"(O6-N6)/(N6*2)","v":0.875},1.7533039647577093]
["3éme","JOYEZ",1.3654545454545455,1502,1100,94.543795041322326,null,1,"GUERIN",1.1736,{"$f":"distance_quilles_a+distance_quilles_b*J7+distance_quilles_c*J7^2","v":85.925326080000005},null,"ABITBOL",4,12,{"$f":"INDEX(Moyennes!$AI$6:$AI$144,MATCH(M7,Joueurs,0))","v":78},456,273,57,1,1.6703296703296704]
["4éme","LABLANCHE",1.077037037037037,1454,1350,81.531834293552805,null,2,"CARREAU",1.1681999999999999,85.680617519999998,null,"LEGRAND",1,3,{"$f":"INDEX(Moyennes!$AI$6:$AI$144,MATCH(M8,Joueurs,0))","v":66},114,69,57,1,1.6521739130434783]
["5éme","ALEXANDRE",1.005859375,1030,1024,78.269462585449219,null,3,"LEMATRE",1.1256999999999999,83.750599019999996,null,"FEVER",2,6,{"$f":"INDEX(Moyennes!$AI$6:$AI$144,MATCH(M9,Joueurs,0))","v":89},296,208,74,1,1.4230769230769231]
["6ème","WEBER",0.98618784530386738,1428,1448,77.364259332743202,null,4,"LAMBIASE",1.0653999999999999,80.999845679999993,null,"GAROIS",7,18,{"$f":"INDEX(Moyennes!$AI$6:$AI$144,MATCH(M10,Joueurs,0))","v":69},790,616,56.428571428571431,0.7857142857142857,1.2824675324675325]
["7ème","AIRAULT",0.79327259985984588,1132,1427,68.405067157615505,null,5,"DUVERNOY",1.0896999999999999,82.110107819999982,null,"THENOT",5,11,{"$f":"INDEX(Moyennes!$AI$6:$AI$144,MATCH(M11,Joueurs,0))","v":70},531,420,53.1,0.6,1.2642857142857142]
["8ème","BARDET",0.97590361445783136,972,996,76.89040499346784,null,6,"GUINGAND",1.0942000000000001,82.31545272000001,null,"OUVRARD",5,11,{"$f":"INDEX(Moyennes!$AI$6:$AI$144,MATCH(M12,Joueurs,0))","v":68},561,499,56.1,0.6,1.1242484969939879]
["9ème","LILLO",0.83201581027667981,842,1012,70.216289896733272,null,7,"ROUBY",1.052,80.386591999999993,null,"HOUPLAIN",2,3,{"$f":"INDEX(Moyennes!$AI$6:$AI$144,MATCH(M13,Joueurs,0))","v":83},251,226,62.75,0.25,1.1106194690265487]
["10ème","REVAULT",0.83083333333333331,997,1200,70.1610986111111,null,8,"GUILLEMANT",1.0249999999999999,79.148750000000007,null,"AIRAULT",4,6,{"$f":"INDEX(Moyennes!$AI$6:$AI$144,MATCH(M14,Joueurs,0))","v":92},490,467,61.25,0.25,1.0492505353319057]
["11ème","TIRITILLI",0.57999999999999996,464,800,58.327199999999998,null,9,"JUBLOT",1.2141,87.756922379999992,null,"DANIAU",2,5,{"$f":"INDEX(Moyennes!$AI$6:$AI$144,MATCH(M15,Joueurs,0))","v":67},186,189,46.5,0.75,0.98412698412698407]
["12ème","REIG",0.5,400,800,54.5,null,10,"HERREBRECHT",1.0943000000000001,82.32001502,null,"LILLO",2,5,{"$f":"INDEX(Moyennes!$AI$6:$AI$144,MATCH(M16,Joueurs,0))","v":69},234,244,58.5,0.75,0.95901639344262291]
["13ème","CARLE",0.40749999999999997,326,800,50.042887499999999,null,11,"DAVID",1.141,84.446237999999994,null,"MICHELET",1,2,{"$f":"INDEX(Moyennes!$AI$6:$AI$144,MATCH(M17,Joueurs,0))","v":65},92,98,46,0.5,0.93877551020408168]
[null,null,null,null,null,null,null,12,"FELLINE",1.0381,79.749696780000008,null,"VIVENOT",11,23,{"$f":"INDEX(Moyennes!$AI$6:$AI$144,MATCH(M18,Joueurs,0))","v":60},934,1031,42.454545454545453,0.54545454545454541,0.90591658583899126]
[null,null,null,null,null,null,null,13,"BONGIOVANNI",1.0184,78.845722879999997,null,"LABLANCHE",4,7,{"$f":"INDEX(Moyennes!$AI$6:$AI$144,MATCH(M19,Joueurs,0))","v":68},337,372,42.125,0.375,0.90591397849462363]
[null,null,null,null,null,null,null,14,"HINGANT",1.389,95.591358,null,"WEBER",5,8,{"$f":"INDEX(Moyennes!$AI$6:$AI$144,MATCH(M20,Joueurs,0))","v":66},461,525,46.1,0.3,0.87809523809523804]
[null,null,null,null,null,null,null,15,"VICARI",1.1655,85.558219500000007,null,"LHOMME",3,6,{"$f":"INDEX(Moyennes!$AI$6:$AI$144,MATCH(M21,Joueurs,0))","v":68},246,281,41,0.5,0.8754448398576512]
[null,null,null,null,null,null,null,16,"MENDOLA",1.5098,100.93100792,null,"TRUFFAUT",2,4,{"$f":"INDEX(Moyennes!$AI$6:$AI$144,MATCH(M22,Joueurs,0))","v":65},191,222,47.75,0.5,0.86036036036036034]
[null,null,null,null,null,null,null,17,"SAINT",1.0055000000000001,78.252939500000011,null,"ALEXANDRE",6,11,{"$f":"INDEX(Moyennes!$AI$6:$AI$144,MATCH(M23,Joueurs,0))","v":64},529,617,44.083333333333336,0.41666666666666669,0.85737439222042144]
[null,null,null,null,null,null,null,18,"FOURRE",1.1498999999999999,84.850459980000011,null,"PARIS Philippe",1,1,{"$f":"INDEX(Moyennes!$AI$6:$AI$144,MATCH(M24,Joueurs,0))","v":65},96,112,48,0,0.8571428571428571]
[null,null,null,null,null,null,null,19,"PICOT",1.1869000000000001,86.527536779999991,null,"DEPARDIEU",2,3,{"$f":"INDEX(Moyennes!$AI$6:$AI$144,MATCH(M25,Joueurs,0))","v":69},145,172,36.25,0.25,0.84302325581395354]
[null,null,null,null,null,null,null,20,"COUPADE",1.2539,89.550469579999998,null,"CARLE",8,13,{"$f":"INDEX(Moyennes!$AI$6:$AI$144,MATCH(M26,Joueurs,0))","v":64},635,788,39.6875,0.3125,0.8058375634517766]
[null,null,null,null,null,null,null,21,"TREAL",1.0983000000000001,82.502474220000011,null,"JACQUIN",3,5,{"$f":"INDEX(Moyennes!$AI$6:$AI$144,MATCH(M27,Joueurs,0))","v":64},222,314,37,0.33333333333333331,0.70700636942675155]
[null,null,null,null,null,null,null,22,"BOUZEMANE",1.145,84.627949999999998,null,"PORCU",3,3,{"$f":"INDEX(Moyennes!$AI$6:$AI$144,MATCH(M28,Joueurs,0))","v":65},224,386,37.333333333333336,0,0.5803108808290155]
[null,null,null,null,null,null,null,23,"GOSSART",1.1171,83.359175179999994,null,"PINTO",1,1,{"$f":"INDEX(Moyennes!$AI$6:$AI$144,MATCH(M29,Joueurs,0))","v":65},49,100,24.5,0,0.49]
[null,null,null,null,null,null,null,24,"RIMBOT",1.1015999999999999,82.652954879999996,null,"FLEURY",3,3,{"$f":"INDEX(Moyennes!$AI$6:$AI$144,MATCH(M30,Joueurs,0))","v":65},166,378,27.666666666666668,0,0.43915343915343913]
[null,null,null,null,null,null,null,25,"GEETS",1.0474000000000001,80.175906480000009,null,"LEBRUN",1,1,{"$f":"INDEX(Moyennes!$AI$6:$AI$144,MATCH(M31,Joueurs,0))","v":65},45,134,22.5,0,0.33582089552238809]
[null,null,null,null,null,null,null,26,"WALLART",1.0672999999999999,81.086741419999996]
[null,null,null,null,null,null,null,27,"HERREBRECHT",1.0703,81.223915820000002]
[null,null,null,null,null,null,null,28,"BONNEAU",1.0585,80.684155500000003]
[null,null,null,null,null,null,null,29,"LANUSSE",0.92369999999999997,74.478556620000006]
[null,null,null,null,null,null,null,30,"ANDRIA",1.0314000000000001,79.442428080000013]
[null,null,null,null,null,null,null,31,"DELORME",1.0466,80.139256880000005]
[null,null,null,null,null,null,null,32,"LEBOEUF",0.99509999999999998,77.774551979999998]
[null,null,null,null,null,null,null,33,"SAUVAGE",0.99539999999999995,{"$f":"distance_quilles_a+distance_quilles_b*J39+distance_quilles_c*J39^2","v":77.78835767999999}]
[null,null,null,null,null,null,null,34,"SAILLANT",1.0590999999999999,80.71161438]
[null,null,null,null,null,null,null,35,"VOI",1.0548,80.514793919999988]
[null,null,null,null,null,null,null,36,"HERREBRECHT",1.0530999999999999,80.436960780000007]
[null,null,null,null,null,null,null,37,"LUCQUIN",1.0704,81.228487680000015]
[null,null,null,null,null,null,null,38,"PAPIN",1.0770999999999999,81.534711179999988]
[null,null,null,null,null,null,null,39,"GOUTALOY",1,78]
[null,null,null,null,null,null,null,40,"PERRIN",1.0573999999999999,80.633810480000008]
[null,null,null,null,null,null,null,41,"GODARD",0.89290000000000003,73.050459180000004]
[null,null,null,null,null,null,null,42,"SACRE",0.9526,75.815106479999997]
[null,null,null,null,null,null,null,43,"COSTA",1.0381,79.749696780000008]
[null,null,null,null,null,null,null,44,"ACETO",1.1255999999999999,83.746049280000008]
[null,null,null,null,null,null,null,45,"LORIN",0.94689999999999996,75.551760779999995]
[null,null,null,null,null,null,null,46,"DI",0.94310000000000005,75.376124779999998]
[null,null,null,null,null,null,null,47,"DEMILLY",1.0415000000000001,79.905555500000006]
[null,null,null,null,null,null,null,48,"RAHMANI",1.0038,78.174771120000003]
[null,null,null,null,null,null,null,49,"VERHAGHE",0.97430000000000005,76.816479020000003]
[null,null,null,null,null,null,null,50,"DUGAY",0.9365,75.070935500000004]
[null,null,null,null,null,null,null,51,"ACUNZO",0.94299999999999995,75.371502000000007]
[null,null,null,null,null,null,null,52,"RUBLINE",0.95609999999999995,75.976745580000014]
[null,null,null,null,null,null,null,53,"LEPAGE",0.83799999999999997,70.495512000000005]
[null,null,null,null,null,null,null,54,"MODAFFERI",1.1093,83.00390702]
[null,null,null,null,null,null,null,55,"FONTAINE",1.1415,84.468955499999993]
[null,null,null,null,null,null,null,56,"ROBERGE",0.99350000000000005,77.700915500000008]
[null,null,null,null,null,null,null,57,"MOREL",0.97719999999999996,76.950160319999995]
[null,null,null,null,null,null,null,58,"DELALANDE",0.93910000000000005,75.191182380000015]
[null,null,null,null,null,null,null,59,"VEREECQUE",1.0029999999999999,78.137981999999994]
[null,null,null,null,null,null,null,60,"DELORME",0.79249999999999998,68.3688875]
[null,null,null,null,null,null,null,61,"BAYON",0.97609999999999997,76.899457580000004]
[null,null,null,null,null,null,null,62,"CHARLES",0.83860000000000001,70.523500080000005]
[null,null,null,null,null,null,null,63,"BORNEQUE",0.78180000000000005,67.867577519999998]
[null,null,null,null,null,null,null,64,"BAUDET",1.0017,78.078194220000015]
[null,null,null,null,null,null,null,65,"JACQ",0.82750000000000001,{"$f":"distance_quilles_a+distance_quilles_b*J71+distance_quilles_c*J71^2","v":70.005487500000001}]
[null,null,null,null,null,null,null,66,"MARCHISSEAU",0.86680000000000001,71.837315520000004]
[null,null,null,null,null,null,null,67,"JUBLOT",0.92310000000000003,74.450772779999994]
[null,null,null,null,null,null,null,68,"HERVELIN",1.2403999999999999,88.942815679999995]
[null,null,null,null,null,null,null,69,"NAHIRNYJ",1.0405,79.859719500000011]
[null,null,null,null,null,null,null,70,"HUGEL",0.8458,70.859244719999992]
[null,null,null,null,null,null,null,71,"VIERA",1.0811999999999999,81.72201312]
[null,null,null,null,null,null,null,72,"BUTTI",0.62970000000000004,60.691955819999997]
[null,null,null,null,null,null,null,73,"BAUDRY",0.75360000000000005,66.544174080000005]
[null,null,null,null,null,null,null,74,"MIKDAD",0.9254,74.557269680000005]
[null,null,null,null,null,null,null,75,"MICHELOTTI",0.81189999999999996,69.276636780000004]
[null,null,null,null,null,null,null,76,"BARDET",0.88200000000000001,72.544151999999997]
[null,null,null,null,null,null,null,77,"DAVOINE",1.1053999999999999,82.826181679999991]
[null,null,null,null,null,null,null,78,"KERCRET",0.66869999999999996,62.540680619999996]
[null,null,null,null,null,null,null,79,"BELLENS",0.94640000000000002,75.528654079999995]
[null,null,null,null,null,null,null,80,"REYNAERT",0.86750000000000005,71.869887500000004]
[null,null,null,null,null,null,null,81,"MAILLE",0.83499999999999996,70.355549999999994]
[null,null,null,null,null,null,null,82,"LEJEUNE",0.91910000000000003,74.265510379999995]
[null,null,null,null,null,null,null,83,"MORMICHE",1.0088999999999999,78.40924158]
[null,null,null,null,null,null,null,84,"BONVILLE",0.68600000000000005,63.35880800000001]
[null,null,null,null,null,null,null,85,"GUERIN",0.67369999999999997,62.777256619999996]
[null,null,null,null,null,null,null,86,"AUCLAIR",1.0066999999999999,78.308110219999989]
[null,null,null,null,null,null,null,87,"CHESNEAU",0.65869999999999995,62.067228619999995]
[null,null,null,null,null,null,null,88,"GANGLOFF",0.98480000000000001,77.300337920000004]
[null,null,null,null,null,null,null,89,"ASTIC",0.9294,74.742431280000005]
[null,null,null,null,null,null,null,90,"ROBIC",0.85760000000000003,71.409044479999991]
[null,null,null,null,null,null,null,91,"FONTAINE",0.80089999999999995,68.76211837999999]
[null,null,null,null,null,null,null,92,"BILLIARD",0.80500000000000005,68.953950000000006]
[null,null,null,null,null,null,null,93,"BERTELOOT",0.77149999999999996,67.384575499999983]
[null,null,null,null,null,null,null,94,"POULEYN",0.76829999999999998,67.234430219999993]
[null,null,null,null,null,null,null,95,"GAROIS",0.81189999999999996,69.276636780000004]
[null,null,null,null,null,null,null,96,"LABLANCHE",0.78290000000000004,67.919135180000012]
[null,null,null,null,null,null,null,97,"HAYES",0.74439999999999995,{"$f":"distance_quilles_a+distance_quilles_b*J103+distance_quilles_c*J103^2","v":66.11173728}]
[null,null,null,null,null,null,null,98,"JOASEM",0.54330000000000001,56.574650220000002]
[null,null,null,null,null,null,null,99,"BUTTI",0.4556,52.364857280000003]
[null,null,null,null,null,null,null,100,"VAROQUEAUX",1.0617000000000001,80.830586220000001]
[null,null,null,null,null,null,null,101,"JANVIER",0.9365,75.070935500000004]
[null,null,null,null,null,null,null,102,"CLAUSSE",0.82350000000000001,69.818695500000004]
[null,null,null,null,null,null,null,103,"VEREECQUE",0.77010000000000001,67.318891979999989]
[null,null,null,null,null,null,null,104,"VEREECQUE",0.74250000000000005,66.022387499999994]
[null,null,null,null,null,null,null,105,"PARENT",0.68420000000000003,63.273740720000006]
[null,null,null,null,null,null,null,106,"EVENOU",0.3483,47.172374220000002]
[null,null,null,null,null,null,null,107,"FAURE",1.0122,78.560902319999997]
[null,null,null,null,null,null,null,108,"TRANNIN",0.94720000000000004,75.565624319999998]
[null,null,null,null,null,null,null,109,"WEBER",0.82,69.655199999999994]
[null,null,null,null,null,null,null,110,"DELORME",0.69,63.547800000000002]
[null,null,null,null,null,null,null,111,"STEINMANN",0.67,62.602199999999996]
[null,null,null,null,null,null,null,112,"BOZON",0.65329999999999999,61.811398220000001]
[null,null,null,null,null,null,null,113,"SORTAIS",0.63,60.706200000000003]
[null,null,null,null,null,null,null,114,"CHANTARAUD",0.63,60.706200000000003]
[null,null,null,null,null,null,null,115,"ROUBY",0.60670000000000002,59.598830220000004]
[null,null,null,null,null,null,null,116,"ASTIC",0.59330000000000005,58.960990220000006]
[null,null,null,null,null,null,null,117,"COTEZ",0.56000000000000005,57.372799999999998]
[null,null,null,null,null,null,null,118,"NAHIRNYJ",0.55000000000000004,56.895000000000003]
[null,null,null,null,null,null,null,119,"MALEK",0.55000000000000004,56.895000000000003]
[null,null,null,null,null,null,null,120,"FRANCOIS",0.49669999999999997,54.341578219999995]
[null,null,null,null,null,null,null,121,"TAIEB",0.49669999999999997,54.341578219999995]
[null,null,null,null,null,null,null,122,"POULET",0.49,54.019800000000004]
[null,null,null,null,null,null,null,123,"FATOUS",0.49,54.019800000000004]
[null,null,null,null,null,null,null,124,"LECROART",0.29330000000000001,44.492950219999997]